Peptide,PTM,ModifiedAA,ModifiedPosition,PeptideUniqueToGene,ExperimentDesc,ExpID,PubmedID,ScoreType,IdentScore,LocProb,Log2FChange,PQ-val,QuantSig,PEP,MassErrorPPM
MESYLNENFDVKAKHSSEEVLEKWR,nta,M,1,true,"HUNTER N-terminome: legumain, GluC and trypsin",119,31951383,"MaxQuant score",72.5320000,,,,,,
MESYLNENFDVK,nta,M,1,true,"Characterization plant N-terminal acetylation",6,22223895,"MASCOT Score",52.5800000,,,,,,
AKHSSEEVLEK,ac,K,14,false,"Quantitative Acetylproteomics",101,29440448,,,,,,,,
AKHSSEEVLEK,ph,S,16,false,"Tissue atlas Arabidopsis - ProteomicsDB",114,32188942,"MaxQuant score",81.4190000,0.8755600,,,,0.00028011100948788,
HSSEEVLEK,ph,S,17,false,"Tissue atlas Arabidopsis - ProteomicsDB",114,32188942,"MaxQuant score",205.9700000,0.9713850,,,,6.6429199457085E-16,
NLCGVVK,sno,C,28,true,"hot5-4 / wildtype, FAT-switch S-nitrosoproteome",169,37277371,,,,0.1517657,0.0597306,NO,,
FRFTANLSK,ph,T,41,false,"Tissue atlas Arabidopsis - ProteomicsDB",114,32188942,"MaxQuant score",88.4200000,0.9999820,,,,0.0045614601112902,
FTANLSKR,ph,S,45,false,"Large-scale phosphorylation discovery",44,23111157,XCorr,2.2110000,,,,,,
FTANLSKR,ph,S,45,false,"atm and atr DNA damage response",88,25561503,"MASCOT Score",34.0000000,0.9910000,,,,,-0.6900000
FTANLSKR,ph,S,45,false,"Tissue atlas Arabidopsis - ProteomicsDB",114,32188942,"MaxQuant score",161.2700000,1.0000000,,,,0.00083380198339,
FTANLSK,ph,S,45,false,"Phospho cell culture sucrose/TOR",109,30833711,,,0.9999990,,,,,
VQDGSCK,sno,C,314,false,"hot5-4 / wildtype, FAT-switch S-nitrosoproteome",169,37277371,,,,,,,,
GASEIVLAACDK,sno,C,588,false,"hot5-4 / wildtype, FAT-switch S-nitrosoproteome",169,37277371,,,,,,,,
ESVELCR,sno,C,669,false,"hot5-4 / wildtype, FAT-switch S-nitrosoproteome",169,37277371,,,,,,,,
SSPMDKHTLVKQLR,ub,K,740,false,"Ubiquitination Membrane Proteins",120,33585938,,,,,,,,
HTLVKQLR,ub,K,740,false,"Ubiquitination Membrane Proteins",120,33585938,,,,,,,,
HTLVKQLR,ub,K,740,false,"upl3 mutant / wildtype",168,35926874,"MaxQuant score",182.6800000,1.0000000,0.4730076,0.3595800,NO,6.2305997516887E-7,-2.4309000
