Peptide,PTM,ModifiedAA,ModifiedPosition,PeptideUniqueToGene,ExperimentDesc,ExpID,PubmedID,ScoreType,IdentScore,LocProb,Log2FChange,PQ-val,QuantSig,PEP,MassErrorPPM
ATASVAFKSRE,nt,A,2,false,"Arg/N-end rule seed, prt6 vs. Wt",99,29168982,"MASCOT Score",37.5600000,,,,,2.2140000055515E-7,-0.6817910
ATASVAFKSRE,nta,A,2,false,"Arg/N-end rule seed, prt6 vs. Wt",99,29168982,"MASCOT Score",37.5600000,,-0.1564883,0.1349592,NO,2.2140000055515E-7,-0.6817910
ATASVAFKSRE,nta,A,2,false,"HUNTER N-terminome: legumain, GluC and trypsin",119,31951383,"MaxQuant score",65.3470000,,,,,,
ATASVAFKSRE,nta,A,2,false,"Arabidopsis translation initiation landscape - NTA",167a,35069635,,,,,,,,
ATASVAFKSR,nta,A,2,false,"Arg/N-end rule pathway Roots",80,25728785,"MASCOT Score",60.2000000,,,,,0.00081499997759238,
KKLELEEAR,ub,K,16,true,"Arabidopsis ubiquitination COFRADIC",40,26744219,"MaxQuant Score",128.2700000,1.0000000,,,,3.2769999961602E-5,0.0040000
KKLELEEAR,ub,K,17,true,"Arabidopsis ubiquitination COFRADIC",40,26744219,"MaxQuant Score",128.2700000,1.0000000,,,,3.2769999961602E-5,0.0040000
GKKIYQAEQYR,ub,K,84,true,"Arabidopsis ubiquitination COFRADIC",40,26744219,"MaxQuant Score",111.8600000,0.9500000,,,,2.1680000017454E-8,-0.1880000
YDAKEEAR,ub,K,163,true,"Arabidopsis ubiquitination COFRADIC",40,26744219,"MaxQuant Score",107.5700000,1.0000000,,,,0.0060000000521541,-0.0480000
NNNENGDDATSDGEEDLDDLRVDEAKVDESR,ph,T,192,true,"SnRK2 protein kinase substrates",85,23776212,XCorr,4.8780212,0.7790000,,,,0.00102056004107,
NNNENGDDATSDGEEDLDDLRVDEAK,ph,T,192,true,"srk2dei ABA signaling phopshoproteomics",83,23572148,"MASCOT Score",90.0000000,,,,,,-0.0003000
NNNENGDDATSDGEEDLDDLRVDEAK,ph,T,192,true,"LAXIC - ABA stress",84a,23660473,XCorr,5.5500000,0.8170000,,,,0.00050487997941673,
NNNENGDDATSDGEEDLDDLRVDEAK,ph,T,192,true,"LAXIC - mannitol vs control",84b,23660473,XCorr,5.6300000,0.8940000,,,,1.5900000066571E-11,
NNNENGDDATSDGEEDLDDLRVDEAK,ph,T,192,true,"Col-0 callus - FC Col-0 vs. Col-0 Xray",111a,31410901,,62.4900000,,0.4773807,0.0000000,NO,,1.2775470
NNNENGDDATSDGEEDLDDLRVDEAK,ph,T,192,true,"Col-0 X-ray callus - FC Col-0 vs. Col-0 Xray",111b,31410901,,62.4900000,,0.4773807,0.0000000,NO,,1.2775470
NNNENGDDATSDGEEDLDDLRVDEAK,ph,T,192,true,"atm callus - FC atm vs. atm Xray",111c,31410901,,62.4900000,,0.6056330,0.0000000,NO,,1.2775470
NNNENGDDATSDGEEDLDDLRVDEAK,ph,T,192,true,"atm-3 X-ray callus - FC atm vs. atm Xray",111d,31410901,,62.4900000,,0.6056330,0.0000000,NO,,1.2775470
NNNENGDDATSDGEEDLDDLRVDEAK,ph,S,193,true,"Arabidopsis root NAA phosphoproteome",18a,27643528,"MaxQuant Score",107.9500000,0.8950000,,,,3.4250000560993E-18,0.1800000
NNNENGDDATSDGEEDLDDLRVDEAK,ph,S,193,true,"Large-scale phosphorylation discovery",44,23111157,XCorr,4.6600000,,,,,,
NNNENGDDATSDGEEDLDDLRVDEAK,ph,S,193,true,"srk2dei ABA signaling phopshoproteomics",83,23572148,"MASCOT Score",92.0000000,,,,,,-0.0022000
NNNENGDDATSDGEEDLDDLRVDEAK,ph,S,193,true,"SnRK2 protein kinase substrates",85,23776212,XCorr,5.8711824,0.9500000,,,,0.023820700123906,
NNNENGDDATSDGEEDLDDLRVDEAK,ph,S,193,true,"Brassinosteroid-Regulated Phosphorylation Dynamics",94,26187819,"MaxQuant Score",141.9700000,0.8460000,,,,3.6339999764423E-17,-3.7200000
NNNENGDDATSDGEEDLDDLRVDEAK,ph,S,193,true,"Phospho cell culture sucrose/TOR",109,30833711,,,0.9738760,,,,,
NNNENGDDATSDGEEDLDDLRVDEAK,ph,S,193,true,"Tissue atlas Arabidopsis - ProteomicsDB",114,32188942,"MaxQuant score",283.7700000,0.9956440,,,,0,
NNNENGDDATSDGEEDLDDLR,ph,S,193,true,"LAXIC - mannitol vs control",84b,23660473,XCorr,4.7300000,0.9940000,,,,1.449999950838E-12,
NNNENGDDATSDGEEDLDDLR,ph,S,193,true,"atm and atr DNA damage response",88,25561503,"MASCOT Score",71.0000000,0.9610000,,,,,-0.3500000
QMDFAKVEKR,ub,K,219,false,"Arabidopsis ubiquitination COFRADIC",40,26744219,"MaxQuant Score",46.8440000,1.0000000,,,,0.0080000003799796,-0.6670000
QMDFAKVEKR,ub,K,222,false,"Arabidopsis ubiquitination COFRADIC",40,26744219,"MaxQuant Score",46.8440000,1.0000000,,,,0.0080000003799796,-0.6670000
EDPLPDADPNEKFYLGDNQYR,ub,K,278,true,"Arabidopsis ubiquitination COFRADIC",40,26744219,"MaxQuant Score",74.7760000,1.0000000,,,,2.5829999341857E-19,0.2270000
EASKESPK,ph,S,455,true,"atm and atr DNA damage response",88,25561503,"MASCOT Score",28.0000000,0.9950000,,,,,-0.7300000
KYNVNYTNDVTSEEMEAYR,ub,K,503,true,"Arabidopsis ubiquitination COFRADIC",40,26744219,"MaxQuant Score",107.7200000,1.0000000,,,,3.0730054933104E-40,0.9010000
KYNVNYTNDVTSEEMEAYR,ph,T,513,true,"srk2dei ABA signaling phopshoproteomics",83,23572148,"MASCOT Score",25.0000000,,,,,,-0.0059000
KYNVNYTNDVTSEEMEAYR,ph,S,514,true,"srk2dei ABA signaling phopshoproteomics",83,23572148,"MASCOT Score",25.0000000,,,,,,-0.0059000
