Peptide,PTM,ModifiedAA,ModifiedPosition,PeptideUniqueToGene,ExperimentDesc,ExpID,PubmedID,ScoreType,IdentScore,LocProb,Log2FChange,PQ-val,QuantSig,PEP,MassErrorPPM
DRDSDSDAPEELTQEQAK,ph,S,9,true,"srk2dei ABA signaling phopshoproteomics",83,23572148,"MASCOT Score",38.0000000,,,,,,0.0003000
DRDSDSDAPEELTQEQAK,ph,S,9,true,"SnRK2 protein kinase substrates",85,23776212,XCorr,2.4034467,0.9990000,,,,0.08828529715538,
DRDSDSDAPEELTQEQAK,ph,S,9,true,"TOR Kinase and ABA Receptor",100,29290610,XCorr,6.9181142,1.0000000,,,,6.785999744352E-7,
DSDSDAPEELTQEQAK,ph,S,9,true,"LAXIC - ABA stress",84a,23660473,XCorr,2.7500000,0.8780000,,,,0.024565299972892,
DSDSDAPEELTQEQAK,ph,S,9,true,"SnRK2 protein kinase substrates",85,23776212,XCorr,2.6500530,0.9160000,,,,0.0011811200529337,
DSDSDAPEELTQEQAK,ph,S,9,true,"Tissue atlas Arabidopsis - ProteomicsDB",114,32188942,"MaxQuant score",333.6400000,1.0000000,,,,0,
SDNKDRDSDSDAPEELTQEQAK,ph,S,11,true,"Tissue atlas Arabidopsis - ProteomicsDB",114,32188942,"MaxQuant score",333.6400000,1.0000000,,,,0,
DRDSDSDAPEELTQEQAK,ph,S,11,true,"srk2dei ABA signaling phopshoproteomics",83,23572148,"MASCOT Score",38.0000000,,,,,,0.0003000
DRDSDSDAPEELTQEQAK,ph,S,11,true,"LAXIC - mannitol vs control",84b,23660473,XCorr,3.2900000,0.8700000,,,,0.0022885201033205,
DRDSDSDAPEELTQEQAK,ph,S,11,true,"TOR Kinase and ABA Receptor",100,29290610,XCorr,6.9181142,1.0000000,,,,6.785999744352E-7,
KLMAEQVTLR,ub,K,49,true,"Arabidopsis ubiquitination COFRADIC",40,26744219,"MaxQuant Score",94.6920000,1.0000000,,,,4.4050000724383E-5,-0.1460000
EKQKAESDSEEEEIIDELPR,ph,S,106,true,"SnRK2 protein kinase substrates",85,23776212,XCorr,3.3730505,1.0000000,,,,3.96250006599E-16,
QKAESDSEEEEIIDELPRK,ph,S,106,true,"srk2dei ABA signaling phopshoproteomics",83,23572148,"MASCOT Score",25.0000000,,,,,,-0.0002000
QKAESDSEEEEIIDELPRK,ph,S,106,true,"Brassinosteroid-Regulated Phosphorylation Dynamics",94,26187819,"MaxQuant Score",209.7100000,1.0000000,,,,7.7687986862168E-42,1.5240000
QKAESDSEEEEIIDELPRK,ph,S,106,true,"Tissue atlas Arabidopsis - ProteomicsDB",114,32188942,"MaxQuant score",305.1000000,1.0000000,,,,0,
QKAESDSEEEEIIDELPR,ph,S,106,true,"SnRK2 protein kinase substrates",85,23776212,XCorr,3.2208133,1.0000000,,,,1.0140000085812E-5,
QKAESDSEEEEIIDELPR,ph,S,106,true,"Phospho cell culture sucrose/TOR",109,30833711,,,1.0000000,,,,,
QKAESDSEEEEIIDELPR,ph,S,106,true,"Col-0 callus - FC Col-0 vs. Col-0 Xray",111a,31410901,,46.0200000,,0.0555490,0.0000000,NO,,0.9640158
QKAESDSEEEEIIDELPR,ph,S,106,true,"Col-0 X-ray callus - FC Col-0 vs. Col-0 Xray",111b,31410901,,46.0200000,,0.0555490,0.0000000,NO,,0.9640158
QKAESDSEEEEIIDELPR,ph,S,106,true,"atm callus - FC atm vs. atm Xray",111c,31410901,,46.0200000,,1.6004688,0.0000000,NO,,0.9640158
QKAESDSEEEEIIDELPR,ph,S,106,true,"atm-3 X-ray callus - FC atm vs. atm Xray",111d,31410901,,46.0200000,,1.6004688,0.0000000,NO,,0.9640158
AESDSEEEEIIDELPRK,ph,S,106,true,"srk2dei ABA signaling phopshoproteomics",83,23572148,"MASCOT Score",38.0000000,,,,,,0.0021000
AESDSEEEEIIDELPRK,ph,S,106,true,"TOR Kinase and ABA Receptor",100,29290610,XCorr,4.9852428,1.0000000,,,,4.5920000957267E-6,
AESDSEEEEIIDELPR,ph,S,106,true,"STN8 phosphoproteome",38,21768351,"MASCOT Score",49.6700000,,,,,,
AESDSEEEEIIDELPR,ph,S,106,true,"Large-scale phosphorylation discovery",44,23111157,XCorr,4.8160000,,,,,,
AESDSEEEEIIDELPR,ph,S,106,true,"Chloroplast kinase substrates",60,19376835,"MASCOT Score",47.9100000,,,,,,-0.9592480
AESDSEEEEIIDELPR,ph,S,106,true,"srk2dei ABA signaling phopshoproteomics",83,23572148,"MASCOT Score",40.0000000,,,,,,0.0029000
AESDSEEEEIIDELPR,ph,S,106,true,"SnRK2 protein kinase substrates",85,23776212,XCorr,4.6320066,1.0000000,,,,0.00031006900826469,
AESDSEEEEIIDELPR,ph,S,106,true,"TOR Kinase and ABA Receptor",100,29290610,XCorr,6.2823730,1.0000000,,,,3.0169999831742E-8,
AESDSEEEEIIDELPR,ph,S,106,true,"Lateral root-induction - NAA vs control",106,23328941,"MASCOT Score",41.0000000,,,,,,
AESDSEEEEIIDELPR,ph,S,106,true,"Col-0 callus - FC Col-0 vs. Col-0 Xray",111a,31410901,,55.4300000,,0.6706546,0.0000000,NO,,0.8760702
AESDSEEEEIIDELPR,ph,S,106,true,"Col-0 X-ray callus - FC Col-0 vs. Col-0 Xray",111b,31410901,,55.4300000,,0.6706546,0.0000000,NO,,0.8760702
AESDSEEEEIIDELPR,ph,S,106,true,"atm callus - FC atm vs. atm Xray",111c,31410901,,55.4300000,,1.9660094,0.0000000,NO,,0.8760702
AESDSEEEEIIDELPR,ph,S,106,true,"atm-3 X-ray callus - FC atm vs. atm Xray",111d,31410901,,55.4300000,,1.9660094,0.0000000,NO,,0.8760702
EKQKAESDSEEEEIIDELPR,ph,S,108,true,"SnRK2 protein kinase substrates",85,23776212,XCorr,3.3730505,1.0000000,,,,3.96250006599E-16,
QKAESDSEEEEIIDELPRK,ph,S,108,true,"srk2dei ABA signaling phopshoproteomics",83,23572148,"MASCOT Score",25.0000000,,,,,,-0.0002000
QKAESDSEEEEIIDELPRK,ph,S,108,true,"Brassinosteroid-Regulated Phosphorylation Dynamics",94,26187819,"MaxQuant Score",209.7100000,1.0000000,,,,7.7687986862168E-42,1.5240000
QKAESDSEEEEIIDELPRK,ph,S,108,true,"Tissue atlas Arabidopsis - ProteomicsDB",114,32188942,"MaxQuant score",305.1000000,1.0000000,,,,0,
QKAESDSEEEEIIDELPR,ph,S,108,true,"SnRK2 protein kinase substrates",85,23776212,XCorr,3.5256851,0.9250000,,,,0.00041636198875494,
QKAESDSEEEEIIDELPR,ph,S,108,true,"Col-0 callus - FC Col-0 vs. Col-0 Xray",111a,31410901,,46.0200000,,0.0555490,0.0000000,NO,,0.9640158
QKAESDSEEEEIIDELPR,ph,S,108,true,"Col-0 X-ray callus - FC Col-0 vs. Col-0 Xray",111b,31410901,,46.0200000,,0.0555490,0.0000000,NO,,0.9640158
QKAESDSEEEEIIDELPR,ph,S,108,true,"atm callus - FC atm vs. atm Xray",111c,31410901,,46.0200000,,1.6004688,0.0000000,NO,,0.9640158
QKAESDSEEEEIIDELPR,ph,S,108,true,"atm-3 X-ray callus - FC atm vs. atm Xray",111d,31410901,,46.0200000,,1.6004688,0.0000000,NO,,0.9640158
AESDSEEEEIIDELPRK,ph,S,108,true,"srk2dei ABA signaling phopshoproteomics",83,23572148,"MASCOT Score",38.0000000,,,,,,0.0021000
AESDSEEEEIIDELPRK,ph,S,108,true,"TOR Kinase and ABA Receptor",100,29290610,XCorr,4.9852428,1.0000000,,,,4.5920000957267E-6,
AESDSEEEEIIDELPR,ph,S,108,true,"Large-scale phosphorylation discovery",44,23111157,XCorr,4.8160000,,,,,,
AESDSEEEEIIDELPR,ph,S,108,true,"Chloroplast kinase substrates",60,19376835,"MASCOT Score",47.9100000,,,,,,-0.9592480
AESDSEEEEIIDELPR,ph,S,108,true,"srk2dei ABA signaling phopshoproteomics",83,23572148,"MASCOT Score",40.0000000,,,,,,0.0029000
AESDSEEEEIIDELPR,ph,S,108,true,"SnRK2 protein kinase substrates",85,23776212,XCorr,4.1707416,1.0000000,,,,1.6896599397409E-10,
AESDSEEEEIIDELPR,ph,S,108,true,"TOR Kinase and ABA Receptor",100,29290610,XCorr,6.2823730,1.0000000,,,,3.0169999831742E-8,
AESDSEEEEIIDELPR,ph,S,108,true,"Lateral root-induction - NAA vs control",106,23328941,"MASCOT Score",41.0000000,,,,,,
AESDSEEEEIIDELPR,ph,S,108,true,"Col-0 callus - FC Col-0 vs. Col-0 Xray",111a,31410901,,55.4300000,,0.6706546,0.0000000,NO,,0.8760702
AESDSEEEEIIDELPR,ph,S,108,true,"Col-0 X-ray callus - FC Col-0 vs. Col-0 Xray",111b,31410901,,55.4300000,,0.6706546,0.0000000,NO,,0.8760702
AESDSEEEEIIDELPR,ph,S,108,true,"atm callus - FC atm vs. atm Xray",111c,31410901,,55.4300000,,1.9660094,0.0000000,NO,,0.8760702
AESDSEEEEIIDELPR,ph,S,108,true,"atm-3 X-ray callus - FC atm vs. atm Xray",111d,31410901,,55.4300000,,1.9660094,0.0000000,NO,,0.8760702
SSSVIKNSGQALR,ub,K,164,true,"Arabidopsis ubiquitination COFRADIC",40,26744219,"MaxQuant Score",147.2600000,1.0000000,,,,1.6479999517405E-21,0.6430000
