Peptide,PTM,ModifiedAA,ModifiedPosition,PeptideUniqueToGene,ExperimentDesc,ExpID,PubmedID,ScoreType,IdentScore,LocProb,Log2FChange,PQ-val,QuantSig,PEP,MassErrorPPM
QFQSMEDHDDHLR,nt,Q,37,true,"N-terminal ChaFRADIC",92,26010716,"MASCOT Score",59.9200000,,,,,0.00010360000305809,
QFQSMEDHDDHLR,nt,Q,37,true,"Stromal N-terminome",96,26371235,"MASCOT Score",58.2100000,,,,,,
QFQSMEDHDDHLR,nt,Q,37,true,"Arg/N-end rule seed, prt6 vs. Wt",99,29168982,"MASCOT Score",73.9200000,,,,,0.0013170000165701,-0.2457672
QFQSMEDHDDHLR,nt,Q,37,true,"HUNTER N-terminome: legumain, GluC and trypsin",119,31951383,"MaxQuant score",77.0780000,,,,,,
QFQSMEDHDDHLR,nta,Q,37,true,"N-terminal ChaFRADIC",92,26010716,"MASCOT Score",59.9200000,,,,,0.00010360000305809,
QFQSMEDHDDHLR,nta,Q,37,true,"Stromal N-terminome",96,26371235,"MASCOT Score",58.2100000,,,,,,
QFQSMEDHDDHLR,nta,Q,37,true,"Arg/N-end rule seed, prt6 vs. Wt",99,29168982,"MASCOT Score",73.9200000,,,,,0.0013170000165701,-0.2457672
QFQSMEDHDDHLR,nta,Q,37,true,"HUNTER N-terminome: legumain, GluC and trypsin",119,31951383,"MaxQuant score",94.1220000,,,,,,
MEDHDDHLRRKF,nta,M,41,true,"Arabidopsis translation initiation landscape - NTA",167a,35069635,,,,,,,,
LQSQLLPCNLPPDVR,sno,C,84,true,"Site-specific nitrosomeproteomic id - gsnor1-3",90a,25699590,XCorr,3.1502171,,,,,7.647000165889E-5,-6.0704955
LQSQLLPCNLPPDVR,sno,C,84,true,"Site-specific nitrosomeproteomic id - gsnor1-3",90b,25699590,XCorr,3.3300000,,,,,0.044730000197887,-6.0700000
LQSQLLPCNLPPDVR,sno,C,84,true,"hot5-4 / wildtype, FAT-switch S-nitrosoproteome",169,37277371,,,,,,,,
QSLLKLPEVNPYVSPSLFVR,nt,Q,196,true,"HUNTER N-terminome: legumain, GluC and trypsin",119,31951383,"MaxQuant score",47.3920000,,,,,,
