Peptide,PTM,ModifiedAA,ModifiedPosition,PeptideUniqueToGene,ExperimentDesc,ExpID,PubmedID,ScoreType,IdentScore,LocProb,Log2FChange,PQ-val,QuantSig,PEP,MassErrorPPM
RGFSDEEGLQHVHQELEAK,ph,S,130,true,"Tissue atlas Arabidopsis - ProteomicsDB",114,32188942,"MaxQuant score",163.9100000,1.0000000,,,,1.2921800373897E-22,
ESRRSPTYEAYPR,ph,S,291,true,"srk2dei ABA signaling phopshoproteomics",83,23572148,"MASCOT Score",40.0000000,,,,,,-0.0008000
ESRRSPTYEAYPR,ph,S,291,true,"Tissue atlas Arabidopsis - ProteomicsDB",114,32188942,"MaxQuant score",95.6620000,0.7533390,,,,8.68487986736E-5,
ESRRSPTYEAYPR,ph,S,294,true,"srk2dei ABA signaling phopshoproteomics",83,23572148,"MASCOT Score",26.0000000,,,,,,-0.0030000
RSPTYEAYPR,ph,S,294,true,"STN8 phosphoproteome",38,21768351,"MASCOT Score",46.9100000,,,,,,-2.2591400
RSPTYEAYPR,ph,S,294,true,"Phosphoproteome ethylene-regulated time response",46,24043427,"MASCOT Score",32.7500000,,,,,,0.9545900
RSPTYEAYPR,ph,S,294,true,"Tyrosine phosphorylation in Arabidopsis",59,18463617,"MASCOT Score",38.0000000,,,,,,-0.4550384
RSPTYEAYPR,ph,S,294,true,"Chloroplast kinase substrates",60,19376835,"MASCOT Score",43.6000000,,,,,,-2.2591400
RSPTYEAYPR,ph,S,294,true,"srk2dei ABA signaling phopshoproteomics",83,23572148,"MASCOT Score",32.0000000,,,,,,-0.0011000
RSPTYEAYPR,ph,S,294,true,"atm and atr DNA damage response",88,25561503,"MASCOT Score",42.0000000,1.0000000,,,,,0.2500000
RSPTYEAYPR,ph,S,294,true,"TOR Kinase and ABA Receptor",100,29290610,XCorr,2.9089088,0.9995000,,,,0.00066139997215942,
RSPTYEAYPR,ph,S,294,true,"Phospho cell culture sucrose/TOR",109,30833711,,,0.9998700,,,,,
RSPTYEAYPR,ph,S,294,true,"Col-0 callus - FC Col-0 vs. Col-0 Xray",111a,31410901,,35.2000000,,-0.9238789,0.0000000,NO,,-0.1488704
RSPTYEAYPR,ph,S,294,true,"Col-0 X-ray callus - FC Col-0 vs. Col-0 Xray",111b,31410901,,35.2000000,,-0.9238789,0.0000000,NO,,-0.1488704
RSPTYEAYPR,ph,S,294,true,"atm callus - FC atm vs. atm Xray",111c,31410901,,35.2000000,,-0.6518728,0.0000000,NO,,-0.1488704
RSPTYEAYPR,ph,S,294,true,"atm-3 X-ray callus - FC atm vs. atm Xray",111d,31410901,,35.2000000,,-0.6518728,0.0000000,NO,,-0.1488704
RSPTYEAYPR,ph,S,294,true,"Tissue atlas Arabidopsis - ProteomicsDB",114,32188942,"MaxQuant score",155.6600000,0.9998430,,,,4.5356100031313E-7,
SPTYEAYPR,ph,S,294,true,"Tyrosine phosphorylation in Arabidopsis",59,18463617,"MASCOT Score",40.0000000,,,,,,-0.2580713
SPTYEAYPR,ph,S,294,true,"srk2dei ABA signaling phopshoproteomics",83,23572148,"MASCOT Score",34.0000000,,,,,,0.0001000
SPTYEAYPR,ph,S,294,true,"atm and atr DNA damage response",88,25561503,"MASCOT Score",37.0000000,1.0000000,,,,,0.7900000
RSPTYEAYPR,ph,T,296,true,"Tyrosine phosphorylation in Arabidopsis",59,18463617,"MASCOT Score",27.0000000,,,,,,-1.2892764
RSPTYEAYPR,ph,T,296,true,"srk2dei ABA signaling phopshoproteomics",83,23572148,"MASCOT Score",28.0000000,,,,,,-0.0007000
RSPTYEAYPR,ph,T,296,true,"atm and atr DNA damage response",88,25561503,"MASCOT Score",27.0000000,0.9950000,,,,,0.0300000
RSPTYEAYPR,ph,T,296,true,"Tissue atlas Arabidopsis - ProteomicsDB",114,32188942,"MaxQuant score",103.0100000,0.9842930,,,,0.00043415100662969,
SRSYSPSYSR,ph,S,310,true,"Tissue atlas Arabidopsis - ProteomicsDB",114,32188942,"MaxQuant score",81.1850000,0.9996000,,,,0.0044288202188909,
SRSYSPSYSR,ph,S,312,true,"Tissue atlas Arabidopsis - ProteomicsDB",114,32188942,"MaxQuant score",81.1850000,0.9798520,,,,0.0044288202188909,
SYSPSYSR,ph,S,314,true,"Tissue atlas Arabidopsis - ProteomicsDB",114,32188942,"MaxQuant score",119.6800000,0.9999200,,,,0.0029748999513686,
GDHSDEISKPK,ph,S,327,true,"atm and atr DNA damage response",88,25561503,"MASCOT Score",27.0000000,1.0000000,,,,,-2.5600000
GDHSDEISKPK,ph,S,327,true,"Tissue atlas Arabidopsis - ProteomicsDB",114,32188942,"MaxQuant score",92.6360000,0.9999970,,,,6.9214096583892E-5,
IEYITEFGGGSGDMRSPK,ph,S,345,true,"srk2dei ABA signaling phopshoproteomics",83,23572148,"MASCOT Score",52.0000000,,,,,,0.0004000
IEYITEFGGGSGDMRSPK,ph,S,345,true,"TOR Kinase and ABA Receptor",100,29290610,XCorr,4.5642161,0.8750000,,,,0.0012029999634251,
IEYITEFGGGSGDMRSPK,ph,S,345,true,"Tissue atlas Arabidopsis - ProteomicsDB",114,32188942,"MaxQuant score",177.3200000,0.8190710,,,,2.0539000146381E-29,
IEYITEFGGGSGDMRSPK,ph,S,350,true,"Chloroplast kinase substrates",60,19376835,"MASCOT Score",41.8500000,,,,,,-1.4304500
IEYITEFGGGSGDMRSPK,ph,S,350,true,"Phospho cell culture sucrose/TOR",109,30833711,,,0.9988280,,,,,
IEYITEFGGGSGDMRSPK,ph,S,350,true,"Tissue atlas Arabidopsis - ProteomicsDB",114,32188942,"MaxQuant score",256.4000000,0.9999920,,,,0,
FEGYSPPR,ph,S,357,true,"Tissue atlas Arabidopsis - ProteomicsDB",114,32188942,"MaxQuant score",147.4200000,0.9999230,,,,3.6293630226013E-43,
FEGYSPPRSPPSQSDLLSRPSPGR,ph,S,361,true,"Tissue atlas Arabidopsis - ProteomicsDB",114,32188942,"MaxQuant score",147.4200000,0.9997170,,,,3.6293630226013E-43,
FEGYSPPRSPPSQSDLLSRPSPGR,ph,S,373,true,"SnRK2 protein kinase substrates",85,23776212,XCorr,2.3427010,0.8960000,,,,0.15231700241566,
FEGYSPPRSPPSQSDLLSRPSPGR,ph,S,373,true,"Tissue atlas Arabidopsis - ProteomicsDB",114,32188942,"MaxQuant score",101.3200000,0.9941740,,,,4.9873501104658E-16,
