Peptide,PTM,ModifiedAA,ModifiedPosition,PeptideUniqueToGene,ExperimentDesc,ExpID,PubmedID,ScoreType,IdentScore,LocProb,Log2FChange,PQ-val,QuantSig,PEP,MassErrorPPM
SDSPNLTTQQK,ph,S,51,true,"atm and atr DNA damage response",88,25561503,"MASCOT Score",55.0000000,1.0000000,,,,,-0.7200000
SDSPNLTTQQK,ph,S,51,true,"Tissue atlas Arabidopsis - ProteomicsDB",114,32188942,"MaxQuant score",155.6100000,0.9998920,,,,2.7375000044572E-8,
DLDLGQSFR,ph,S,108,true,"Tissue atlas Arabidopsis - ProteomicsDB",114,32188942,"MaxQuant score",90.0500000,1.0000000,,,,0.0023789799306542,
NIYYGANSSNASPHHQYNQFK,ph,S,270,true,"Tissue atlas Arabidopsis - ProteomicsDB",114,32188942,"MaxQuant score",169.6000000,0.9523170,,,,1.3841000255917E-36,
SSPAASSSSMAAVNILR,fuc,S,298,true,"SPINDLY O-fucosylation",162,36739885,,,,,,,0.76999998092651,
EREEELEENEEDQETKNSNDDK,ph,S,590,true,"Tissue atlas Arabidopsis - ProteomicsDB",114,32188942,"MaxQuant score",195.7300000,0.9988640,,,,0,
SNNNESNFTAVR,ph,S,598,true,"atm and atr DNA damage response",88,25561503,"MASCOT Score",62.0000000,0.9990000,,,,,-0.2800000
SNNNESNFTAVR,ph,S,598,true,"Tissue atlas Arabidopsis - ProteomicsDB",114,32188942,"MaxQuant score",150.2900000,1.0000000,,,,5.5826501466072E-7,
TTSQTPTTTAPDASDADAAVATGHR,ph,S,612,true,"TOR Kinase and ABA Receptor",100,29290610,XCorr,4.1388884,0.7706000,,,,6.3119998117145E-9,
TTSQTPTTTAPDASDADAAVATGHR,ph,S,612,true,"Tissue atlas Arabidopsis - ProteomicsDB",114,32188942,"MaxQuant score",136.0000000,0.9723680,,,,2.0196899968602E-35,
TTSQTPTTTAPDASDADAAVATGHR,ph,T,614,true,"Tissue atlas Arabidopsis - ProteomicsDB",114,32188942,"MaxQuant score",77.5220000,0.7518380,,,,2.6533699681863E-9,
