Peptide,PTM,ModifiedAA,ModifiedPosition,PeptideUniqueToGene,ExperimentDesc,ExpID,PubmedID,ScoreType,IdentScore,LocProb,Log2FChange,PQ-val,QuantSig,PEP,MassErrorPPM
SSSSIVSSSVVTKEDN,nt,S,50,true,"HUNTER N-terminome: legumain, GluC and trypsin",119,31951383,"MaxQuant score",115.5700000,,,,,,
SSSSIVSSSVVTKE,nt,S,50,true,"N-terminal ChaFRADIC",92,26010716,"MASCOT Score",41.0200000,,,,,0.002686999971047,
SSSSIVSSSVVTKE,nt,S,50,true,"Arg/N-end rule seed, prt6 vs. Wt",99,29168982,"MASCOT Score",43.6600000,,0.2976618,0.2382783,NO,1.1229999472562E-6,4.2053105
SSSSIVSSSVVTKE,nta,S,50,true,"N-terminal ChaFRADIC",92,26010716,"MASCOT Score",41.0200000,,,,,0.002686999971047,
SSSSIVSSSVVTKE,nta,S,50,true,"Arg/N-end rule seed, prt6 vs. Wt",99,29168982,"MASCOT Score",43.6600000,,-0.2158107,0.0598718,NO,1.1229999472562E-6,4.2053105
SSSIVSSSVVTKEDNLR,nt,S,51,true,"N-terminal ChaFRADIC",92,26010716,"MASCOT Score",21.1100000,,,,,0.00013230000331532,
SSSIVSSSVVTKE,nt,S,51,true,"N-terminal ChaFRADIC",92,26010716,"MASCOT Score",46.8100000,,,,,0.005927000194788,
SSSIVSSSVVTKE,nt,S,51,true,"Arg/N-end rule seed, prt6 vs. Wt",99,29168982,"MASCOT Score",36.3100000,,0.1000706,0.5316527,NO,2.4060000214376E-5,-1.1013866
SSSIVSSSVVTKEDNLR,nta,S,51,true,"N-terminal ChaFRADIC",92,26010716,"MASCOT Score",21.1100000,,,,,0.00013230000331532,
SSSIVSSSVVTKE,nta,S,51,true,"N-terminal ChaFRADIC",92,26010716,"MASCOT Score",46.8100000,,,,,0.005927000194788,
SSIVSSSVVTKEDNLR,nt,S,52,true,"N-terminal ChaFRADIC",92,26010716,"MASCOT Score",29.4100000,,,,,0.00024090000079013,
SSIVSSSVVTKEDNLR,nt,S,52,true,"Stromal N-terminome",96,26371235,"MASCOT Score",44.2100000,,,,,,
SSIVSSSVVTKEDN,nt,S,52,true,"HUNTER N-terminome: legumain, GluC and trypsin",119,31951383,"MaxQuant score",168.6100000,,,,,,
SSIVSSSVVTKE,nt,S,52,true,"N-terminal ChaFRADIC",92,26010716,"MASCOT Score",58.5000000,,,,,0.0031999999191612,
SSIVSSSVVTKE,nt,S,52,true,"Arg/N-end rule seed, prt6 vs. Wt",99,29168982,"MASCOT Score",66.0700000,,0.1256643,0.3715238,NO,1.5340000381059E-9,-1.6667486
SSIVSSSVVTKE,nt,S,52,true,"HUNTER N-terminome: legumain, GluC and trypsin",119,31951383,"MaxQuant score",113.6300000,,,,,,
SSIVSSSVVTKEDNLR,nta,S,52,true,"N-terminal ChaFRADIC",92,26010716,"MASCOT Score",29.4100000,,,,,0.00024090000079013,
SSIVSSSVVTKE,nta,S,52,true,"N-terminal ChaFRADIC",92,26010716,"MASCOT Score",58.5000000,,,,,0.0031999999191612,
SSIVSSSVVTKE,nta,S,52,true,"Arg/N-end rule seed, prt6 vs. Wt",99,29168982,"MASCOT Score",60.1600000,,-0.0110687,0.9477721,NO,5.4010001804272E-6,-1.5331343
SSIVSSSVVTKE,nta,S,52,true,"HUNTER N-terminome: legumain, GluC and trypsin",119,31951383,"MaxQuant score",,,,,,,
SSIVSSSVVTK,nta,S,52,true,"Characterization plant N-terminal acetylation",6,22223895,"MASCOT Score",53.7700000,,,,,,
SIVSSSVVTKE,nt,S,53,true,"Arg/N-end rule seed, prt6 vs. Wt",99,29168982,"MASCOT Score",38.6100000,,0.0193378,0.9400661,NO,0.00066840002546087,0.1399612
SSVVTKEDNLR,nt,S,57,true,"N-terminal ChaFRADIC",92,26010716,"MASCOT Score",35.7600000,,,,,3.4199999277007E-7,
SSVVTKEDNLR,nt,S,57,true,"Arg/N-end rule seed, prt6 vs. Wt",99,29168982,"MASCOT Score",20.0700000,,0.2073029,0.2765535,NO,0.0037380000576377,-0.8034309
SSVVTKEDNLR,nt,S,57,true,"Arabidopsis translation initiation landscape - NT",167b,35069635,,,,,,,,
SVVTKEDNLR,nt,S,58,true,"N-terminal ChaFRADIC",92,26010716,"MASCOT Score",30.1100000,,,,,0.00011970000196015,
YSLLAGGKR,ac,K,116,false,"Quantitative Acetylproteomics",101,29440448,,,,,,,,
SSDVVSPV,nt,S,201,true,"N-terminal ChaFRADIC",92,26010716,"MASCOT Score",29.5600000,,,,,0.039639998227358,
