Peptide,PTM,ModifiedAA,ModifiedPosition,PeptideUniqueToGene,ExperimentDesc,ExpID,PubmedID,ScoreType,IdentScore,LocProb,Log2FChange,PQ-val,QuantSig,PEP,MassErrorPPM
GCVPSK,ox,C,7,false,"OxiTRAQ Arabidopsis - 5 mM H2O2 versus control",47,24376095,,,,-0.0950833,0.3795106,NO,,
GCVPSK,sno,C,7,false,"hot5-4 / wildtype, FAT-switch S-nitrosoproteome",169,37277371,,,,,,,,
KKPATTGDGPGIDDDNDATNAPIQIDDDQTTIDGDR,ph,T,31,true,"Tissue atlas Arabidopsis - ProteomicsDB",114,32188942,"MaxQuant score",126.8800000,0.9951110,,,,0,
KKPATTGDGPGIDDDNDATNAPIQIDDDQTTIDGDR,ph,T,43,true,"Tissue atlas Arabidopsis - ProteomicsDB",114,32188942,"MaxQuant score",256.4000000,0.9920490,,,,0,
TTATNTGGTTTPAITTTAAK,ph,T,52,true,"Lateral root-induction - NAA vs control",106,23328941,"MASCOT Score",27.0000000,,,,,,
TTATNTGGTTTPAITTTAAK,ph,T,52,true,"Col-0 callus - FC Col-0 vs. Col-0 Xray",111a,31410901,,37.8900000,,-1.2817273,0.0000000,NO,,0.9880484
TTATNTGGTTTPAITTTAAK,ph,T,52,true,"Col-0 X-ray callus - FC Col-0 vs. Col-0 Xray",111b,31410901,,37.8900000,,-1.2817273,0.0000000,NO,,0.9880484
TTATNTGGTTTPAITTTAAK,ph,T,52,true,"atm callus - FC atm vs. atm Xray",111c,31410901,,37.8900000,,-2.3133306,0.0000000,NO,,0.9880484
TTATNTGGTTTPAITTTAAK,ph,T,52,true,"atm-3 X-ray callus - FC atm vs. atm Xray",111d,31410901,,37.8900000,,-2.3133306,0.0000000,NO,,0.9880484
TTATNTGGTTTPAITTTAAK,ph,T,52,true,"Tissue atlas Arabidopsis - ProteomicsDB",114,32188942,"MaxQuant score",175.5900000,0.9920540,,,,2.6608399437661E-35,
TTATNTGGTTTPAITTTAAK,ph,T,54,true,"Large-scale phosphorylation discovery",44,23111157,XCorr,4.4050000,,,,,,
TTATNTGGTTTPAITTTAAK,ph,T,54,true,"LAXIC - ABA stress",84a,23660473,XCorr,5.0000000,1.0000000,,,,0.00036271300632507,
TTATNTGGTTTPAITTTAAK,ph,T,54,true,"TOR Kinase and ABA Receptor",100,29290610,XCorr,5.5054488,0.9714000,,,,9.2879997737327E-7,
TTATNTGGTTTPAITTTAAK,ph,T,54,true,"Phosphorylation tonoplast membrane fraction",107,18686298,"MASCOT Score",96.0000000,,,,,,
TTATNTGGTTTPAITTTAAK,ph,T,54,true,"Col-0 callus - FC Col-0 vs. Col-0 Xray",111a,31410901,,56.3100000,,3.9812474,0.0000000,NO,,1.4807654
TTATNTGGTTTPAITTTAAK,ph,T,54,true,"Col-0 X-ray callus - FC Col-0 vs. Col-0 Xray",111b,31410901,,56.3100000,,3.9812474,0.0000000,NO,,1.4807654
TTATNTGGTTTPAITTTAAK,ph,T,54,true,"atm callus - FC atm vs. atm Xray",111c,31410901,,56.3100000,,0.1712275,0.0000000,NO,,1.4807654
TTATNTGGTTTPAITTTAAK,ph,T,54,true,"atm-3 X-ray callus - FC atm vs. atm Xray",111d,31410901,,56.3100000,,0.1712275,0.0000000,NO,,1.4807654
TTATNTGGTTTPAITTTAAK,ph,T,54,true,"Tissue atlas Arabidopsis - ProteomicsDB",114,32188942,"MaxQuant score",403.3700000,1.0000000,,,,0,
TTATNTGGTTTPAITTTAAK,ph,T,57,true,"atm and atr DNA damage response",88,25561503,"MASCOT Score",48.0000000,1.0000000,,,,,-0.3700000
TTATNTGGTTTPAITTTAAK,ph,T,57,true,"Tissue atlas Arabidopsis - ProteomicsDB",114,32188942,"MaxQuant score",297.5500000,0.9968770,,,,0,
TTATNTGGTTTPAITTTAAK,ph,T,58,true,"atm and atr DNA damage response",88,25561503,"MASCOT Score",48.0000000,1.0000000,,,,,-0.3700000
TTATNTGGTTTPAITTTAAK,ph,T,58,true,"Lateral root-induction - NAA vs control",106,23328941,"MASCOT Score",30.0000000,,0.5526705,0.0276108,YES,,
TTATNTGGTTTPAITTTAAK,ph,T,58,true,"Tissue atlas Arabidopsis - ProteomicsDB",114,32188942,"MaxQuant score",353.7400000,0.9479970,,,,0,
TTATNTGGTTTPAITTTAAK,ph,T,59,true,"Large-scale phosphorylation discovery",44,23111157,XCorr,5.0300000,,,,,,
TTATNTGGTTTPAITTTAAK,ph,T,59,true,"LAXIC - ABA stress",84a,23660473,XCorr,4.3300000,0.9090000,,,,4.6099998485261E-8,
TTATNTGGTTTPAITTTAAK,ph,T,59,true,"atm and atr DNA damage response",88,25561503,"MASCOT Score",48.0000000,1.0000000,,,,,-0.3700000
TTATNTGGTTTPAITTTAAK,ph,T,59,true,"Lateral root-induction - NAA vs control",106,23328941,"MASCOT Score",62.0000000,,,,,,
TTATNTGGTTTPAITTTAAK,ph,T,59,true,"Tissue atlas Arabidopsis - ProteomicsDB",114,32188942,"MaxQuant score",369.9800000,0.9998570,,,,0,
TTATNTGGTTTPAITTTAAK,ph,T,63,true,"Large-scale phosphorylation discovery",44,23111157,XCorr,3.3670000,,,,,,
TTATNTGGTTTPAITTTAAK,ph,T,63,true,"TOR Kinase and ABA Receptor",100,29290610,XCorr,4.0435905,0.8583000,,,,3.7210000300547E-5,
TTATNTGGTTTPAITTTAAKISSPLK,ub,K,68,true,"upl3 mutant / wildtype",168,35926874,"MaxQuant score",96.0520000,1.0000000,-0.2986727,0.7264000,NO,1.7575199628972E-10,0.7868500
