Peptide,PTM,ModifiedAA,ModifiedPosition,PeptideUniqueToGene,ExperimentDesc,ExpID,PubmedID,ScoreType,IdentScore,LocProb,Log2FChange,PQ-val,QuantSig,PEP,MassErrorPPM
SEFEDHEGNGTVADAIYDEENGGR,nta,S,2,true,"Arg/N-end rule pathway Roots",80,25728785,"MASCOT Score",40.6800000,,,,,0.00012749999586958,
SEFEDHEGNGTVADAIYDEENGGR,nta,S,2,true,"HUNTER N-terminome: legumain, GluC and trypsin",119,31951383,"MaxQuant score",109.6800000,,,,,,
SEFEDHEGNGTVADAIYDEENGGR,nta,S,2,true,"Arabidopsis translation initiation landscape - NTA",167a,35069635,,,,,,,,
DGEIEDQLDSKPK,ph,S,35,true,"Tissue atlas Arabidopsis - ProteomicsDB",114,32188942,"MaxQuant score",151.5600000,1.0000000,,,,6.9652401180065E-7,
ERDSEVSRR,ph,S,68,true,"Tissue atlas Arabidopsis - ProteomicsDB",114,32188942,"MaxQuant score",53.6000000,0.9995150,,,,0.015538999810815,
ERDSEVSR,ph,S,68,true,"atm and atr DNA damage response",88,25561503,"MASCOT Score",32.0000000,0.9900000,,,,,-0.1800000
DDDDYRRSR,ph,S,127,true,"atm and atr DNA damage response",88,25561503,"MASCOT Score",35.0000000,1.0000000,,,,,-0.3800000
SMMPIQAMTQQATR,nt,S,223,true,"Arabidopsis translation initiation landscape - NT",167b,35069635,,,,,,,,
