Peptide,PTM,ModifiedAA,ModifiedPosition,PeptideUniqueToGene,ExperimentDesc,ExpID,PubmedID,ScoreType,IdentScore,LocProb,Log2FChange,PQ-val,QuantSig,PEP,MassErrorPPM
VHNAYDSFQLLKDCPAR,nt,V,2,true,"HUNTER N-terminome: legumain, GluC and trypsin",119,31951383,"MaxQuant score",73.1660000,,,,,,
LFAGCYDGSLR,ox,C,33,true,"SPEAR - 50 mM H2O2 / mock",138b,34619326,,,,1.6005670,0.0435198,YES,,
MVDISGDEASLSR,ph,S,392,true,"Tissue atlas Arabidopsis - ProteomicsDB",114,32188942,"MaxQuant score",162.3700000,1.0000000,,,,7.4156097928935E-11,
MVDISGDEASLSR,ph,S,397,true,"Tissue atlas Arabidopsis - ProteomicsDB",114,32188942,"MaxQuant score",188.1200000,0.9746410,,,,1.4500500371862E-22,
MVDISGDEASLSR,ph,S,399,true,"Tissue atlas Arabidopsis - ProteomicsDB",114,32188942,"MaxQuant score",156.1700000,0.8317470,,,,6.7964300853873E-10,
GSSGISDDMESSSPR,ph,S,403,true,"atm and atr DNA damage response",88,25561503,"MASCOT Score",57.0000000,0.9760000,,,,,-0.3600000
GSSGISDDMESSSPR,ph,S,403,true,"Tissue atlas Arabidopsis - ProteomicsDB",114,32188942,"MaxQuant score",75.9980000,0.9473810,,,,9.8699601949193E-5,
GSSGISDDMESSSPR,ph,S,406,true,"atm and atr DNA damage response",88,25561503,"MASCOT Score",61.0000000,0.9770000,,,,,-0.4200000
GSSGISDDMESSSPR,ph,S,406,true,"Tissue atlas Arabidopsis - ProteomicsDB",114,32188942,"MaxQuant score",184.4800000,0.9997090,,,,1.6896000438765E-27,
GSSGISDDMESSSPR,ph,S,411,true,"Conserved plant phosphoproteome - Arabidopsis",61a,20466843,"MASCOT Score",20.0000000,1.0000000,,,,,
GSSGISDDMESSSPR,ph,S,412,true,"atm and atr DNA damage response",88,25561503,"MASCOT Score",46.0000000,0.9900000,,,,,-0.2000000
GSSGISDDMESSSPR,ph,S,413,true,"Tyrosine phosphorylation in Arabidopsis",59,18463617,"MASCOT Score",69.0000000,,,,,,-0.3143495
GSSGISDDMESSSPR,ph,S,413,true,"srk2dei ABA signaling phopshoproteomics",83,23572148,"MASCOT Score",81.0000000,,,,,,-0.0006000
GSSGISDDMESSSPR,ph,S,413,true,"SnRK2 protein kinase substrates",85,23776212,XCorr,2.1509225,0.9890000,,,,0.043089300394058,
GSSGISDDMESSSPR,ph,S,413,true,"atm and atr DNA damage response",88,25561503,"MASCOT Score",96.0000000,0.9900000,,,,,-0.5500000
GSSGISDDMESSSPR,ph,S,413,true,"TOR Kinase and ABA Receptor",100,29290610,XCorr,4.0560083,0.9919000,,,,9.1750003150537E-8,
GSSGISDDMESSSPR,ph,S,413,true,"Lateral root-induction - NAA vs control",106,23328941,"MASCOT Score",54.0000000,,,,,,
GSSGISDDMESSSPR,ph,S,413,true,"Tissue atlas Arabidopsis - ProteomicsDB",114,32188942,"MaxQuant score",240.7800000,0.8662570,,,,0,
YFLESEDNADLESKK,ph,S,420,true,"Tissue atlas Arabidopsis - ProteomicsDB",114,32188942,"MaxQuant score",250.1900000,1.0000000,,,,0,
KMSHNTLMALIK,ph,T,435,true,"SnRK2 protein kinase substrates",85,23776212,XCorr,2.1248953,0.8400000,,,,0.024256199598312,
ATSEGTEEVISDAVGK,ph,S,464,true,"Tissue atlas Arabidopsis - ProteomicsDB",114,32188942,"MaxQuant score",276.9900000,1.0000000,,,,0,
GVNYSDVKICEEILMKSK,ub,K,532,true,"Protein ubiquitination during photomorphogenesis",3,28461270,,,,,,,,
GVNYSDVKICEEILMKSK,ub,K,540,true,"Protein ubiquitination during photomorphogenesis",3,28461270,,,,,,,,
IVALGSFESSDTTK,ph,S,806,true,"Large-scale phosphorylation discovery",44,23111157,XCorr,3.1660000,,,,,,
IVALGSFESSDTTK,ph,S,806,true,"LAXIC - mannitol vs control",84b,23660473,XCorr,2.9700000,0.9990000,,,,0.0020592398941517,
IVALGSFESSDTTK,ph,S,806,true,"atm and atr DNA damage response",88,25561503,"MASCOT Score",87.0000000,1.0000000,,,,,0.5600000
IVALGSFESSDTTK,ph,S,806,true,"Tissue atlas Arabidopsis - ProteomicsDB",114,32188942,"MaxQuant score",194.5500000,0.9999990,,,,1.4072200223976E-31,
MMDSVLSSK,ph,S,821,true,"atm and atr DNA damage response",88,25561503,"MASCOT Score",43.0000000,0.9460000,,,,,-1.6800000
MMDSVLSSK,ph,S,821,true,"TOR Kinase and ABA Receptor",100,29290610,XCorr,3.1250334,0.9409000,,,,0.00097589998040348,
MMDSVLSSK,ph,S,821,true,"Tissue atlas Arabidopsis - ProteomicsDB",114,32188942,"MaxQuant score",122.5500000,0.9688180,,,,5.8169498515781E-5,
MMDSVLSSK,ph,S,822,true,"atm and atr DNA damage response",88,25561503,"MASCOT Score",24.0000000,0.9560000,,,,,-0.1900000
VGLSSSTDSGR,ph,S,847,true,"Tissue atlas Arabidopsis - ProteomicsDB",114,32188942,"MaxQuant score",114.7200000,0.8307120,,,,2.9943699701107E-5,
VGLSSSTDSGR,ph,S,848,true,"Tissue atlas Arabidopsis - ProteomicsDB",114,32188942,"MaxQuant score",141.3800000,0.8435440,,,,3.6097600286666E-7,
