Peptide,PTM,ModifiedAA,ModifiedPosition,PeptideUniqueToGene,ExperimentDesc,ExpID,PubmedID,ScoreType,IdentScore,LocProb,Log2FChange,PQ-val,QuantSig,PEP,MassErrorPPM
MEAMKETVEESLR,nta,M,1,true,"Tic56 chloroplast import - tic56-1",89c,25588737,XCorr,3.9259601,,,,,,
MEAMKETVEESLR,nta,M,1,true,"N-terminal ChaFRADIC",92,26010716,"MASCOT Score",23.0600000,,,,,0.00037570000858977,
MEAMKETVEESLR,nta,M,1,true,"Arg/N-end rule seed, prt6 vs. Wt",99,29168982,"MASCOT Score",50.6400000,,-0.7227790,0.0436905,NO,0.00075329997343943,-2.6209660
MEAMKETVEESLR,nta,M,1,true,"FtsH12 N-terminome: WT / FtsH12 knockdown miRNA",118,33216923,"MaxQuant score",166.0400000,,,,,2.4799999729973E-16,
MEAMKETVEE,nta,M,1,true,"N-term acetylation drought responses",5,26184543,,,,,,,,
DNEDKICNALFQDLGK,ub,K,47,true,"upl3 mutant / wildtype",168,35926874,"MaxQuant score",117.4800000,1.0000000,1.0792928,0.1399770,NO,4.8953898712512E-9,0.4727700
ICNALFQDLGK,ox,C,49,true,"SPEAR - 10 mM H2O2 / mock",138a,34619326,,,,3.3285551,0.0001577,YES,,
TATVAINCLDK,sno,C,81,true,"hot5-4 / wildtype, FAT-switch S-nitrosoproteome",169,37277371,,,,0.4796687,0.0061141,NO,,
TIPAYLDTKAIK,ub,K,165,true,"upl3 mutant / wildtype",168,35926874,"MaxQuant score",62.0880000,1.0000000,-0.2601519,,,0.001099789980799,2.0144000
CPTIVDHHTISK,sno,C,219,true,"hot5-4 / wildtype, FAT-switch S-nitrosoproteome",169,37277371,,,,,,,,
ESGCLSR,sno,C,289,true,"hot5-4 / wildtype, FAT-switch S-nitrosoproteome",169,37277371,,,,0.5180997,0.0636730,NO,,
