Peptide,PTM,ModifiedAA,ModifiedPosition,PeptideUniqueToGene,ExperimentDesc,ExpID,PubmedID,ScoreType,IdentScore,LocProb,Log2FChange,PQ-val,QuantSig,PEP,MassErrorPPM
NLTSLEVFNVAGNR,ng,N,138,true,"Conserved N-glycosylation",74,22633491,"MaxQuant Score",110.9800000,1.0000000,,,,4.3439999330985E-7,-0.4230000
NLTSLEVFNVAGNR,ng,N,138,true,"UDP-GlcNAc transporter glycopeptide analysis",135,30224661,,,,,,,6.8646828672858E-12,1.5000000
LANNSLTGEIPVEIK,ng,N,365,true,"Conserved N-glycosylation",74,22633491,"MaxQuant Score",154.5000000,0.8220000,,,,1.3259999981863E-28,-0.1080000
LANNSLTGEIPVEIK,ng,N,365,true,"N-linked Glycan Micro-heterogeneity Arabidopsis",134,29237727,,,,,,,,
LANNSLTGEIPVEIK,ng,N,365,true,"UDP-GlcNAc transporter glycopeptide analysis",135,30224661,,,,,,,4.0662653501495E-14,1.2000000
YVNLSSNSFSGEIPQTFGFLR,ng,N,554,true,"ER-associatied N-glycan degradation chilling stres",133,27558752,,,,,,,,
INNTSEFSGNTELCGKPLNR,ng,N,718,true,"Conserved N-glycosylation",74,22633491,"MaxQuant Score",156.1700000,0.9090000,,,,1.2319999962069E-36,-0.1610000
LTIRSPSR,ph,S,994,true,"Phospho cell culture sucrose/TOR",109,30833711,,,0.9982920,,,,,
LTIRSPSR,ph,S,994,true,"Tissue atlas Arabidopsis - ProteomicsDB",114,32188942,"MaxQuant score",191.5500000,1.0000000,,,,1.3362700279629E-8,
VGPDVPSSADPTSQPSPA,ph,S,1125,true,"atm and atr DNA damage response",88,25561503,"MASCOT Score",38.0000000,0.9990000,,,,,-0.1500000
VGPDVPSSADPTSQPSPA,ph,S,1126,true,"atm and atr DNA damage response",88,25561503,"MASCOT Score",38.0000000,0.9990000,,,,,-0.1500000
VGPDVPSSADPTSQPSPA,ph,S,1134,true,"Phytohormone-responsive phosphoproteins",34,20374526,"MASCOT Score",58.0000000,,,,,,-2.2105500
VGPDVPSSADPTSQPSPA,ph,S,1134,true,"atm and atr DNA damage response",88,25561503,"MASCOT Score",85.0000000,1.0000000,,,,,0.0500000
VGPDVPSSADPTSQPSPA,ph,S,1134,true,"TOR Kinase and ABA Receptor",100,29290610,XCorr,2.8788917,0.9957000,,,,0.010130000300705,
VGPDVPSSADPTSQPSPA,ph,S,1134,true,"Tissue atlas Arabidopsis - ProteomicsDB",114,32188942,"MaxQuant score",107.3600000,0.9999060,,,,2.3904500601191E-9,
