Peptide,PTM,ModifiedAA,ModifiedPosition,PeptideUniqueToGene,ExperimentDesc,ExpID,PubmedID,ScoreType,IdentScore,LocProb,Log2FChange,PQ-val,QuantSig,PEP,MassErrorPPM
ATSMHHAVVMASK,ph,S,304,true,"atm and atr DNA damage response",88,25561503,"MASCOT Score",40.0000000,0.9920000,,,,,-2.7500000
ATSMHHAVVMASK,ph,S,304,true,"Tissue atlas Arabidopsis - ProteomicsDB",114,32188942,"MaxQuant score",41.4220000,0.9763970,,,,0.01562360022217,
AVGSGSKSNLSSR,ph,S,364,true,"Tissue atlas Arabidopsis - ProteomicsDB",114,32188942,"MaxQuant score",73.8340000,0.9585600,,,,0.0030774299520999,
SYSMSSQIK,ph,S,388,true,"Large-scale phosphorylation discovery",44,23111157,XCorr,2.4700000,,,,,,
SYSMSSQIK,ph,S,388,true,"atm and atr DNA damage response",88,25561503,"MASCOT Score",39.0000000,0.9920000,,,,,-0.8700000
SYSMSSQIK,ph,S,388,true,"Tissue atlas Arabidopsis - ProteomicsDB",114,32188942,"MaxQuant score",82.4940000,0.9981180,,,,0.001112150028348,
AYGSIAHQSR,ph,S,398,true,"atm and atr DNA damage response",88,25561503,"MASCOT Score",61.0000000,1.0000000,,,,,-0.3900000
AYGSIAHQSR,ph,S,398,true,"Tissue atlas Arabidopsis - ProteomicsDB",114,32188942,"MaxQuant score",88.1870000,0.9999970,,,,0.0015497499844059,
AYGSIAHQSR,ph,S,403,true,"atm and atr DNA damage response",88,25561503,"MASCOT Score",48.0000000,1.0000000,,,,,0.6400000
AYGSIAHQSR,ph,S,403,true,"Tissue atlas Arabidopsis - ProteomicsDB",114,32188942,"MaxQuant score",118.7600000,0.9999970,,,,0.00016347899509128,
IVENADAGSDLLIPCVR,sno,C,522,true,"hot5-4 / wildtype, FAT-switch S-nitrosoproteome",169,37277371,,,,,,,,
LELYQSR,ph,S,662,false,"Tissue atlas Arabidopsis - ProteomicsDB",114,32188942,"MaxQuant score",155.4200000,1.0000000,,,,0.0098000904545188,
