Peptide,PTM,ModifiedAA,ModifiedPosition,PeptideUniqueToGene,ExperimentDesc,ExpID,PubmedID,ScoreType,IdentScore,LocProb,Log2FChange,PQ-val,QuantSig,PEP,MassErrorPPM
TLSCSYPNLR,ph,S,181,true,"atm and atr DNA damage response",88,25561503,"MASCOT Score",28.0000000,1.0000000,,,,,-0.3900000
TLSCSYPNLR,ph,S,181,true,"TOR Kinase and ABA Receptor",100,29290610,XCorr,2.4537950,0.9588000,,,,0.0070310002192855,
TLSCSYPNLR,ph,S,181,true,"Tissue atlas Arabidopsis - ProteomicsDB",114,32188942,"MaxQuant score",146.1700000,0.9999740,,,,6.0269502455412E-7,
SQEHYDVAQCEVIQR,ph,S,207,true,"Tissue atlas Arabidopsis - ProteomicsDB",114,32188942,"MaxQuant score",70.9600000,0.9998980,,,,0.00046647200360894,
SQEHYDVAQCEVIQR,acy,C,216,true,"Arabidopsis S-acylation atlas - Hypocotyl",163b,35681017,,,,,,,,
LIGVTQAAAAVEPDSEK,ph,T,226,true,"Tissue atlas Arabidopsis - ProteomicsDB",114,32188942,"MaxQuant score",84.8950000,1.0000000,,,,0.0004728689964395,
SSSMKTEYSYDEDSPKK,ph,S,253,true,"Tissue atlas Arabidopsis - ProteomicsDB",114,32188942,"MaxQuant score",88.5410000,0.8899750,,,,0.00014403999375645,
TEYSYDEDSPKK,ph,S,259,true,"Tissue atlas Arabidopsis - ProteomicsDB",114,32188942,"MaxQuant score",114.3100000,0.9953250,,,,3.6366600397741E-5,
TEYSYDEDSPKK,ph,S,264,true,"atm and atr DNA damage response",88,25561503,"MASCOT Score",64.0000000,1.0000000,,,,,-0.5500000
TEYSYDEDSPKK,ph,S,264,true,"TOR Kinase and ABA Receptor",100,29290610,XCorr,3.6796975,1.0000000,,,,0.0087069999426603,
TEYSYDEDSPKK,ph,S,264,true,"Tissue atlas Arabidopsis - ProteomicsDB",114,32188942,"MaxQuant score",179.5000000,1.0000000,,,,9.4591502240768E-20,
STSNVSSGHDLLSR,ph,S,276,true,"Large-scale phosphorylation discovery",44,23111157,XCorr,3.1410000,,,,,,
STSNVSSGHDLLSR,ph,S,276,true,"Tissue atlas Arabidopsis - ProteomicsDB",114,32188942,"MaxQuant score",118.4700000,0.8350150,,,,3.9625501813134E-5,
STSNVSSGHDLLSR,ph,T,277,true,"atm and atr DNA damage response",88,25561503,"MASCOT Score",36.0000000,0.9830000,,,,,-0.2000000
STSNVSSGHDLLSR,ph,S,278,true,"atm and atr DNA damage response",88,25561503,"MASCOT Score",85.0000000,0.9620000,,,,,-0.3200000
STSNVSSGHDLLSR,ph,S,278,true,"TOR Kinase and ABA Receptor",100,29290610,XCorr,3.3470798,0.9752000,,,,1.4960000044084E-5,
STSNVSSGHDLLSR,ph,S,278,true,"Tissue atlas Arabidopsis - ProteomicsDB",114,32188942,"MaxQuant score",209.4200000,0.9998690,,,,2.0206723855564E-42,
STSNVSSGHDLLSR,ph,S,281,true,"atm and atr DNA damage response",88,25561503,"MASCOT Score",29.0000000,0.9680000,,,,,0.0300000
STSNVSSGHDLLSR,ph,S,281,true,"Tissue atlas Arabidopsis - ProteomicsDB",114,32188942,"MaxQuant score",127.1800000,0.9543410,,,,3.7174198951107E-5,
STSNVSSGHDLLSR,ph,S,282,true,"Tissue atlas Arabidopsis - ProteomicsDB",114,32188942,"MaxQuant score",53.7730000,0.8060060,,,,0.0024409499019384,
TFFFPCGTLAK,acy,C,322,true,"Arabidopsis S-acylation atlas - Silique",163e,35681017,,,,,,,,
TKISPPSSQFMEH,ph,S,412,true,"atm and atr DNA damage response",88,25561503,"MASCOT Score",33.0000000,0.8980000,,,,,-0.2200000
TKISPPSSQFMEH,ph,S,412,true,"Tissue atlas Arabidopsis - ProteomicsDB",114,32188942,"MaxQuant score",121.9900000,0.9993670,,,,0.00012105899804737,
