Peptide,PTM,ModifiedAA,ModifiedPosition,PeptideUniqueToGene,ExperimentDesc,ExpID,PubmedID,ScoreType,IdentScore,LocProb,Log2FChange,PQ-val,QuantSig,PEP,MassErrorPPM
ASENPFRSIL,nt,A,2,true,"N-term acetylation drought responses",5,26184543,,,,,,,,
ASENPFRSILKALEKPDGGE,nta,A,2,true,"Arabidopsis translation initiation landscape - NTA",167a,35069635,,,,,,,,
ASENPFRSIL,nta,A,2,true,"N-term acetylation drought responses",5,26184543,,,,,,,,
ASENPFR,nta,A,2,true,"Characterization plant N-terminal acetylation",6,22223895,"MASCOT Score",52.6100000,,,,,,
NCDEFQVK,ox,C,54,true,"OxiTRAQ Arabidopsis - 5 mM H2O2 versus control",47,24376095,,,,-0.0311350,0.7702832,NO,,
NCDEFQVK,so,C,54,true,"S-sulfenylation site detection using YAP1C",110,32714340,,,,,,,,
ILDWENTSPK,ph,S,74,true,"Tissue atlas Arabidopsis - ProteomicsDB",114,32188942,"MaxQuant score",191.7900000,0.9530250,,,,1.4460699619082E-13,
TSPKQVEIPFKPAR,ac,K,76,false,"Quantitative Acetylproteomics",101,29440448,,,,,,,,
ILDWENTSPKQVEIPFKPAR,ub,K,76,true,"upl3 mutant / wildtype",168,35926874,"MaxQuant score",73.9280000,1.0000000,-0.0846703,,,1.199140024255E-5,1.6921000
QVEIPFKPAR,ac,K,83,false,"Quantitative Acetylproteomics",101,29440448,,,,,,,,
DFTGVPAVVDLACMR,nt,D,91,false,"Arg/N-end rule seed, prt6 vs. Wt",99,29168982,"MASCOT Score",34.5400000,,-0.0040615,0.9947048,NO,0.16279999911785,-1.1207375
DFTGVPAVVDLACMR,nta,D,91,false,"FtsH12 N-terminome: WT / FtsH12 knockdown miRNA",118,33216923,"MaxQuant score",72.1100000,,,,,2.7100000465907E-7,
VLLQDFTGVPAVVDLACMR,so,C,103,false,"S-sulfenylation site detection using YAP1C",110,32714340,,,,,,,,
SENAVQANMELEFQR,nt,S,139,false,"Arabidopsis translation initiation landscape - NT",167b,35069635,,,,,,,,
SDDTVSMIEAYLR,nt,S,330,true,"Arabidopsis translation initiation landscape - NT",167b,35069635,,,,,,,,
SDDTVSMIEAYLR,ph,S,335,true,"SnRK2 protein kinase substrates",85,23776212,XCorr,3.0200670,1.0000000,,,,4.2891401790257E-6,
SDDTVSMIEAYLR,ph,S,335,true,"TOR Kinase and ABA Receptor",100,29290610,XCorr,4.2346749,1.0000000,,,,2.169999970647E-5,
SDDTVSMIEAYLR,ph,S,335,true,"Phospho cell culture sucrose/TOR",109,30833711,,,0.9946610,,,,,
ADWHSCLDNR,ox,C,396,true,"Bicarbonate Induced Redox Changes - 2 hr",117c,28184230,,,,0.0426443,,YES,,
ADWHSCLDNR,sno,C,396,true,"Site-specific nitrosomeproteomic id - gsnor1-3",90a,25699590,XCorr,2.4827480,,,,,0.048239998519421,-7.0719102
ADWHSCLDNR,sno,C,396,true,"hot5-4 / wildtype, FAT-switch S-nitrosoproteome",169,37277371,,,,0.2439874,0.1273330,NO,,
ADWHSCLDNR,so,C,396,true,"Arabidopsis S-sulfenylation chemoproteomics",108,31578252,"pFind PSM Score",0.0307853,,1.6302800,,,,0.3548165
ADWHSCLDNR,so,C,396,true,"S-sulfenylation site detection using YAP1C",110,32714340,,,,,,,,
ACDLGLEVKPWIK,ox,C,461,true,"SPEAR - 50 mM H2O2 / mock",138b,34619326,,,,-1.6711019,0.0205906,YES,,
ACDLGLEVKPWIK,so,C,461,true,"Arabidopsis S-sulfenylation chemoproteomics",108,31578252,"pFind PSM Score",0.0036223,,1.0855100,,,,-1.0555965
ACDLGLEVKPWIK,so,C,461,true,"S-sulfenylation site detection using YAP1C",110,32714340,,,,,,,,
YLAKSGLQK,ac,K,488,true,"Quantitative Acetylproteomics",101,29440448,,,,,,,,
IGNSGDIHE,nt,I,511,true,"Arg/N-end rule seed, prt6 vs. Wt",99,29168982,"MASCOT Score",31.0800000,,0.3959051,0.0993580,NO,0.024420000612736,0.3035663
GMTMSPPGPHGVK,mox,M,656,true,"cat2 Methionine oxidation - 1h stress",62a,25693801,"MASCOT Score",43.0000000,,0.1981205,,NO,,
GMTMSPPGPHGVK,mox,M,658,true,"cat2 Methionine oxidation - 1h stress",62a,25693801,"MASCOT Score",43.0000000,,0.1981205,,NO,,
GMTMSPPGPHGVK,ph,S,659,true,"atm and atr DNA damage response",88,25561503,"MASCOT Score",50.0000000,1.0000000,,,,,-0.6500000
GMTMSPPGPHGVK,ph,S,659,true,"Tissue atlas Arabidopsis - ProteomicsDB",114,32188942,"MaxQuant score",145.6200000,0.9999690,,,,2.8848398869741E-7,
DAYCLLNFGDSITTDHISPAGSIHK,so,C,671,true,"S-sulfenylation site detection using YAP1C",110,32714340,,,,,,,,
DAYCLLNFGDSITTDHISPAGSIHKDSPAAK,ub,K,692,true,"upl3 mutant / wildtype",168,35926874,"MaxQuant score",118.9700000,1.0000000,0.2485348,,,5.2035299938425E-22,-1.4076000
DFNSYGSRR,ph,S,715,false,"Tissue atlas Arabidopsis - ProteomicsDB",114,32188942,"MaxQuant score",111.6300000,0.9999510,,,,0.00036946099135093,
IVNKHLK,ac,K,736,true,"Quantitative Acetylproteomics",101,29440448,,,,,,,,
GEVGPKTVHIPTGEK,ac,K,745,true,"Quantitative Acetylproteomics",101,29440448,,,,,,,,
LSVFDAAMK,mox,M,762,true,"cat2 Methionine oxidation - 1h stress",62a,25693801,"MASCOT Score",65.0000000,,0.4298457,,NO,,
LSVFDAAMK,mox,M,762,true,"cat2 Methionine oxidation - 3h stress",62b,25693801,"MASCOT Score",52.0000000,,-0.0269071,,NO,,
DTIILAGAEYGSGSSR,nt,D,770,false,"Metacaspase9 substrates - in vitro rMC9",51c,23964026,"MASCOT Score",56.0000000,,4.5605318,,NO,,-0.5402738
AVISKSFER,ac,K,803,true,"Quantitative Acetylproteomics",101,29440448,,,,,,,,
SNLVGMGIIPLCFK,ox,C,822,false,"OxiTRAQ SA and flg22 responses - SA vs mock",91a,25720653,"MASCOT Score",67.3100000,,0.5260688,0.0000000,NO,,
SNLVGMGIIPLCFK,ox,C,822,false,"OxiTRAQ SA and flg22 responses - flg22 vs mock",91b,25720653,"MASCOT Score",67.3100000,,0.5945485,0.0010000,YES,,
SNLVGMGIIPLCFK,ox,C,822,false,"Redox kickstart of mitochondria",112,31871212,,,,-1.5824127,0.0196971,YES,,
SNLVGMGIIPLCFK,so,C,822,false,"S-sulfenylation site detection using YAP1C",110,32714340,,,,,,,,
SFTCTLRFDTEVELAYFDHGGILQYVIR,cn,C,869,true,"Cellular regulation by S-cyanylation",115,30377236,,,,,,,,
