Peptide,PTM,ModifiedAA,ModifiedPosition,PeptideUniqueToGene,ExperimentDesc,ExpID,PubmedID,ScoreType,IdentScore,LocProb,Log2FChange,PQ-val,QuantSig,PEP,MassErrorPPM
IATYFDNE,nt,I,311,true,"Arg/N-end rule seed, prt6 vs. Wt",99,29168982,"MASCOT Score",51.4000000,,-0.4694543,0.1974893,NO,0.029440000653267,-0.9689923
TVQCALEYTTLR,so,C,1156,true,"Arabidopsis S-sulfenylation chemoproteomics",108,31578252,"pFind PSM Score",0.1222800,,,,,,-1.4147740
IMNDEGPKGELQDESAEDDVFLK,ub,K,1267,true,"upl3 mutant / wildtype",168,35926874,"MaxQuant score",96.0160000,1.0000000,0.4070808,0.2618400,NO,8.5568796492907E-9,-1.0001000
KIESNMLTEMALRGIPDINK,ub,K,1283,true,"Arabidopsis ubiquitination by TUBEs",2,23667124,,,,,,,,
SPVSGTPYHEGMMSPNYLLSPNMR,ph,S,1495,true,"Tissue atlas Arabidopsis - ProteomicsDB",114,32188942,"MaxQuant score",43.4440000,0.8267860,,,,0.0031431999523193,
SPVSGTPYHEGMMSPNYLLSPNMR,ph,S,1508,true,"Phospho cell culture sucrose/TOR",109,30833711,,,0.9706050,,,,,
SPVSGTPYHEGMMSPNYLLSPNMR,ph,S,1508,true,"Tissue atlas Arabidopsis - ProteomicsDB",114,32188942,"MaxQuant score",211.1100000,0.9999990,,,,0,
SPVSGTPYHEGMMSPNYLLSPNMR,ph,S,1514,true,"Phospho cell culture sucrose/TOR",109,30833711,,,0.9997850,,,,,
SPVSGTPYHEGMMSPNYLLSPNMR,ph,S,1514,true,"Tissue atlas Arabidopsis - ProteomicsDB",114,32188942,"MaxQuant score",264.4400000,1.0000000,,,,0,
YSPSIAYSPSNAR,ph,Y,1733,true,"LAXIC - mannitol vs control",84b,23660473,XCorr,3.0500000,0.9420000,-1.6558358,,NO,0.00044462800724432,
YSPSIAYSPSNAR,ph,Y,1733,true,"SnRK2 protein kinase substrates",85,23776212,XCorr,2.5340865,0.9960000,,,,3.6506401102088E-6,
YSPSIAYSPSNAR,ph,Y,1733,true,"Lateral root-induction - NAA vs control",106,23328941,"MASCOT Score",40.0000000,,,,,,
YSPSIAYSPSNAR,ph,S,1734,true,"atm and atr DNA damage response",88,25561503,"MASCOT Score",52.0000000,0.9940000,,,,,0.5100000
YSPSIAYSPSNAR,ph,S,1734,true,"Lateral root-induction - NAA vs control",106,23328941,"MASCOT Score",41.0000000,,,,,,
YSPSIAYSPSNAR,ph,S,1734,true,"Phospho cell culture sucrose/TOR",109,30833711,,,0.8477210,,,,,
YSPSIAYSPSNAR,ph,S,1734,true,"Tissue atlas Arabidopsis - ProteomicsDB",114,32188942,"MaxQuant score",189.8000000,1.0000000,,,,2.7632800856192E-30,
YSPSIAYSPSNAR,ph,S,1736,true,"atm and atr DNA damage response",88,25561503,"MASCOT Score",52.0000000,0.9350000,,,,,0.0200000
YSPSIAYSPSNAR,ph,S,1736,true,"Tissue atlas Arabidopsis - ProteomicsDB",114,32188942,"MaxQuant score",54.8590000,0.9948120,,,,0.012652000412345,
YSPSIAYSPSNAR,ph,S,1740,true,"STN8 phosphoproteome",38,21768351,"MASCOT Score",47.0700000,,,,,,-1.4042000
YSPSIAYSPSNAR,ph,S,1740,true,"Large-scale phosphorylation discovery",44,23111157,XCorr,3.5430000,,,,,,
YSPSIAYSPSNAR,ph,S,1740,true,"Conserved plant phosphoproteome - Arabidopsis",61a,20466843,"MASCOT Score",23.0000000,1.0000000,,,,,
YSPSIAYSPSNAR,ph,S,1740,true,"LAXIC - mannitol vs control",84b,23660473,XCorr,3.0500000,0.9420000,-1.6558358,,NO,0.00044462800724432,
YSPSIAYSPSNAR,ph,S,1740,true,"SnRK2 protein kinase substrates",85,23776212,XCorr,2.5374310,0.9960000,,,,0.0053807399235666,
YSPSIAYSPSNAR,ph,S,1740,true,"atm and atr DNA damage response",88,25561503,"MASCOT Score",57.0000000,0.9530000,,,,,0.3300000
YSPSIAYSPSNAR,ph,S,1740,true,"TOR Kinase and ABA Receptor",100,29290610,XCorr,3.8345513,0.8817000,,,,2.2209999315237E-6,
YSPSIAYSPSNAR,ph,S,1740,true,"Lateral root-induction - NAA vs control",106,23328941,"MASCOT Score",40.0000000,,,,,,
YSPSIAYSPSNAR,ph,S,1740,true,"Tissue atlas Arabidopsis - ProteomicsDB",114,32188942,"MaxQuant score",205.3700000,0.9971390,,,,8.3513394773136E-39,
YSPSIAYSPSNAR,ph,S,1742,true,"atm and atr DNA damage response",88,25561503,"MASCOT Score",33.0000000,0.9970000,,,,,-1.2800000
YSPSIAYSPSNAR,ph,S,1742,true,"Lateral root-induction - NAA vs control",106,23328941,"MASCOT Score",41.0000000,,,,,,
YSPSIAYSPSNAR,ph,S,1742,true,"Tissue atlas Arabidopsis - ProteomicsDB",114,32188942,"MaxQuant score",155.5600000,0.9791290,,,,7.2262501538134E-10,
