Peptide,PTM,ModifiedAA,ModifiedPosition,PeptideUniqueToGene,ExperimentDesc,ExpID,PubmedID,ScoreType,IdentScore,LocProb,Log2FChange,PQ-val,QuantSig,PEP,MassErrorPPM
LLESPNLK,ph,S,68,true,"Tissue atlas Arabidopsis - ProteomicsDB",114,32188942,"MaxQuant score",77.3790000,1.0000000,,,,0.010309999808669,
NFKPDSMLGQGGFGK,ph,S,90,true,"atm and atr DNA damage response",88,25561503,"MASCOT Score",64.0000000,1.0000000,,,,,-0.5800000
NFKPDSMLGQGGFGK,ph,S,90,true,"TOR Kinase and ABA Receptor",100,29290610,XCorr,3.7019904,1.0000000,,,,0.00014249999367166,
NFKPDSMLGQGGFGK,ph,S,90,true,"Tissue atlas Arabidopsis - ProteomicsDB",114,32188942,"MaxQuant score",158.4100000,1.0000000,,,,4.3834900986806E-12,
VGSGMIVAIKR,ph,S,117,true,"Tissue atlas Arabidopsis - ProteomicsDB",114,32188942,"MaxQuant score",183.3300000,1.0000000,,,,8.225740089074E-10,
VGSGMIVAIK,ph,S,117,true,"Plasmamembrane phosphorylation",20,15308754,,,,,,,,
VGSGMIVAIK,ph,S,117,true,"Phosphorylation Early Elicitor Signaling",23,17317660,,,,,,,,
VGSGMIVAIK,ph,S,117,true,"Sucrose-induced phosphorylation",24,17586839,,,,,,,,
VGSGMIVAIK,ph,S,117,true,"Plasmembrane Ph Immune Responses",25,17651370,,,,,,,,
VGSGMIVAIK,ph,S,117,true,"Tyrosine phosphorylation in Arabidopsis",59,18463617,"MASCOT Score",31.0000000,,,,,,0.3796761
VGSGMIVAIK,ph,S,117,true,"Conserved plant phosphoproteome - Arabidopsis",61a,20466843,"MASCOT Score",31.0000000,1.0000000,,,,,
VGSGMIVAIK,ph,S,117,true,"atm and atr DNA damage response",88,25561503,"MASCOT Score",48.0000000,1.0000000,,,,,0.2200000
VGSGMIVAIK,ph,S,117,true,"TOR Kinase and ABA Receptor",100,29290610,XCorr,3.9655390,1.0000000,,,,0.00017990000196733,
VGSGMIVAIK,ph,S,117,true,"Phospho cell culture sucrose/TOR",109,30833711,,,1.0000000,,,,,
VGSGMIVAIK,ph,S,117,true,"Touch-induced phosphorylation: 40s touch vs untouc",136,30291188,"MASCOT score",75.3800000,,0.0770862,0.7144638,NO,,10.5665124
LGPADEKSHVTTR,ph,S,249,true,"Tissue atlas Arabidopsis - ProteomicsDB",114,32188942,"MaxQuant score",52.7310000,0.9149230,,,,0.0049867201596498,
QAVANSSRSSPHHYR,ph,S,391,true,"TOR Kinase and ABA Receptor",100,29290610,XCorr,2.4377332,0.8130000,,,,0.045820001512766,
