Peptide,PTM,ModifiedAA,ModifiedPosition,PeptideUniqueToGene,ExperimentDesc,ExpID,PubmedID,ScoreType,IdentScore,LocProb,Log2FChange,PQ-val,QuantSig,PEP,MassErrorPPM
MKDNQTEVESR,nub,M,1,true,"Arabidopsis ubiquitination COFRADIC",40,26744219,"MaxQuant Score",63.0910000,,,,,0.00088140001753345,-1.5180000
MKDNQTEVESR,ub,K,2,true,"Arabidopsis ubiquitination COFRADIC",40,26744219,"MaxQuant Score",63.0910000,1.0000000,,,,0.00088140001753345,-1.5180000
DNQTEVESRSTDDRLK,ph,S,12,true,"TOR Kinase and ABA Receptor",100,29290610,XCorr,3.1091068,0.9821000,,,,0.0097970003262162,
KEFNLANPDNKSVGNVGR,ub,K,50,true,"Arabidopsis ubiquitination COFRADIC",40,26744219,"MaxQuant Score",48.9070000,1.0000000,,,,3.4710001273197E-7,-0.2890000
EFNLANPDNKSVGNVGR,nt,E,51,true,"Metacaspase9 substrates - in vitro rMC9",51c,23964026,"MASCOT Score",101.0000000,,,,,,-0.7614263
KEFNLANPDNKSVGNVGR,ub,K,60,true,"Arabidopsis ubiquitination COFRADIC",40,26744219,"MaxQuant Score",56.1210000,1.0000000,,,,4.2840000991085E-10,0.0380000
TMTEEERAPFVAK,mox,M,76,true,"cat2 Methionine oxidation - 3h stress",62b,25693801,"MASCOT Score",41.0000000,,-0.3302053,,NO,,
APFVAKSQSK,ub,K,87,true,"upl3 mutant / wildtype",168,35926874,"MaxQuant score",137.4600000,1.0000000,-0.2125675,0.8056400,NO,1.1756100320781E-5,1.8569000
