Peptide,PTM,ModifiedAA,ModifiedPosition,PeptideUniqueToGene,ExperimentDesc,ExpID,PubmedID,ScoreType,IdentScore,LocProb,Log2FChange,PQ-val,QuantSig,PEP,MassErrorPPM
MDLMQMDKRL,nta,M,1,true,"N-term acetylation drought responses",5,26184543,,,,,,,,
MDLMQMDKR,nta,M,1,true,"Arg/N-end rule pathway Roots",80,25728785,"MASCOT Score",25.0100000,,,,,0.093189999461174,
MDLMQMDKR,nta,M,1,true,"N-terminal ChaFRADIC",92,26010716,"MASCOT Score",28.7300000,,,,,0.0068069999106228,
MDLMQMDKR,nta,M,1,true,"Arabidopsis translation initiation landscape - NTA",167a,35069635,,,,,,,,
GLIDNVEKEDQACLEAIAR,ox,C,53,true,"SPEAR - 10 mM H2O2 / mock",138a,34619326,,,,-3.2053763,0.0114894,YES,,
KSSEVPGELFMVLQEMK,ph,S,64,true,"Phosphorylation Early Elicitor Signaling",23,17317660,,,,,,,,
KSSEVPGELFMVLQEMK,ph,S,64,true,"Tissue atlas Arabidopsis - ProteomicsDB",114,32188942,"MaxQuant score",103.6600000,0.8928150,,,,1.3729099919146E-6,
ASNCIASPSSNGSVSSRPPLPPATTTAAR,ph,S,119,true,"Tissue atlas Arabidopsis - ProteomicsDB",114,32188942,"MaxQuant score",203.6100000,0.9990500,,,,0,
SDSQSSLNFSER,ph,S,142,true,"srk2dei ABA signaling phopshoproteomics",83,23572148,"MASCOT Score",64.0000000,,,,,,-0.0001000
SDSQSSLNFSERAPVRPK,ph,S,144,true,"STN8 phosphoproteome",38,21768351,"MASCOT Score",45.1100000,,,,,,-1.2194200
SDSQSSLNFSER,ph,S,144,true,"srk2dei ABA signaling phopshoproteomics",83,23572148,"MASCOT Score",68.0000000,,,,,,-0.0001000
SDSQSSLNFSER,ph,S,144,true,"LAXIC - ABA stress",84a,23660473,XCorr,3.8900000,0.9470000,,,,0.00025615000049584,
SDSQSSLNFSER,ph,S,144,true,"atm and atr DNA damage response",88,25561503,"MASCOT Score",60.0000000,1.0000000,,,,,-0.7600000
SDSQSSLNFSER,ph,S,144,true,"Protein sumoylation and phosphorylation cross-talk",97,28419593,,,,,,,,
SDSQSSLNFSER,ph,S,144,true,"TOR Kinase and ABA Receptor",100,29290610,XCorr,4.1958385,0.9823000,,,,4.8359997890657E-6,
SDSQSSLNFSER,ph,S,144,true,"Tissue atlas Arabidopsis - ProteomicsDB",114,32188942,"MaxQuant score",277.5400000,1.0000000,,,,0,
SDSQSSLNFSER,ph,S,146,true,"atm and atr DNA damage response",88,25561503,"MASCOT Score",30.0000000,0.9900000,,,,,-0.0500000
SDSQSSLNFSER,ph,S,147,true,"Large-scale phosphorylation discovery",44,23111157,XCorr,3.5890000,,,,,,
SDSQSSLNFSER,ph,S,147,true,"atm and atr DNA damage response",88,25561503,"MASCOT Score",42.0000000,0.9970000,,,,,0.0700000
SDSQSSLNFSER,ph,S,147,true,"Tissue atlas Arabidopsis - ProteomicsDB",114,32188942,"MaxQuant score",104.9400000,0.9978720,,,,7.6452401117422E-5,
DMVSRDDSFVTK,ph,S,167,true,"Chloroplast kinase substrates",60,19376835,"MASCOT Score",46.0000000,,,,,,-0.5688700
DMVSRDDSFVTK,ph,S,167,true,"srk2dei ABA signaling phopshoproteomics",83,23572148,"MASCOT Score",30.0000000,,,,,,-0.0004000
DMVSRDDSFVTK,ph,S,167,true,"atm and atr DNA damage response",88,25561503,"MASCOT Score",39.0000000,1.0000000,,,,,0.2700000
DMVSRDDSFVTK,ph,S,167,true,"Protein sumoylation and phosphorylation cross-talk",97,28419593,,,,,,,,
DMVSRDDSFVTK,ph,S,167,true,"TOR Kinase and ABA Receptor",100,29290610,XCorr,3.0881417,0.9991000,,,,0.0054279998876154,
DDSFVTK,ph,S,167,true,"STN8 phosphoproteome",38,21768351,"MASCOT Score",39.5600000,,,,,,-3.5718700
DDSFVTK,ph,S,167,true,"Chloroplast kinase substrates",60,19376835,"MASCOT Score",39.9700000,,,,,,-3.5718700
DDSFVTK,ph,S,167,true,"Tissue atlas Arabidopsis - ProteomicsDB",114,32188942,"MaxQuant score",152.7900000,1.0000000,,,,1.0085100257129E-6,
RPQILDSTLTTGNDGEK,ph,T,197,true,"atm and atr DNA damage response",88,25561503,"MASCOT Score",65.0000000,0.9980000,,,,,0.3000000
RPQILDSTLTTGNDGEK,ph,T,197,true,"Tissue atlas Arabidopsis - ProteomicsDB",114,32188942,"MaxQuant score",92.9500000,0.9737320,,,,1.0694499906094E-5,
LASLIEVSAK,ph,S,212,false,"atm and atr DNA damage response",88,25561503,"MASCOT Score",73.0000000,1.0000000,,,,,-1.2800000
LASLIEVSAK,ph,S,212,false,"Tissue atlas Arabidopsis - ProteomicsDB",114,32188942,"MaxQuant score",107.0900000,1.0000000,,,,0.00023744899954181,
KQSSMEIV,ph,S,544,true,"atm and atr DNA damage response",88,25561503,"MASCOT Score",24.0000000,1.0000000,,,,,-0.4800000
KQSSMEIV,ph,S,544,true,"Tissue atlas Arabidopsis - ProteomicsDB",114,32188942,"MaxQuant score",109.8300000,0.9690780,,,,0.0017890799790621,
