Peptide,PTM,ModifiedAA,ModifiedPosition,PeptideUniqueToGene,ExperimentDesc,ExpID,PubmedID,ScoreType,IdentScore,LocProb,Log2FChange,PQ-val,QuantSig,PEP,MassErrorPPM
TALGPPTGSSTTLSPAQDSTFR,ph,S,471,true,"Tissue atlas Arabidopsis - ProteomicsDB",114,32188942,"MaxQuant score",231.9300000,0.7629830,,,,0,
MNSDTLAPQNK,ph,S,748,true,"Tissue atlas Arabidopsis - ProteomicsDB",114,32188942,"MaxQuant score",92.9900000,0.9898010,,,,0.00024506499175914,
IEHLQLLGEVSPSEKR,ph,S,934,true,"Tissue atlas Arabidopsis - ProteomicsDB",114,32188942,"MaxQuant score",159.1400000,0.9768730,,,,1.9377799739166E-14,
IEHLQLLGEVSPSEKR,ph,S,936,true,"Tissue atlas Arabidopsis - ProteomicsDB",114,32188942,"MaxQuant score",129.4300000,0.9891060,,,,1.8041200533503E-8,
RGSFQNPSVMAVVR,ph,S,964,true,"TOR Kinase and ABA Receptor",100,29290610,XCorr,4.3270707,1.0000000,,,,9.6539999105971E-8,
RGSFQNPSVMAVVR,ph,S,964,true,"Tissue atlas Arabidopsis - ProteomicsDB",114,32188942,"MaxQuant score",178.0000000,1.0000000,,,,1.1798000487916E-22,
GGSYDSTSLVK,ph,S,978,true,"Tissue atlas Arabidopsis - ProteomicsDB",114,32188942,"MaxQuant score",140.5700000,0.9999440,,,,6.2138099110598E-7,
GGSYDSTSLVK,ph,S,981,true,"Tissue atlas Arabidopsis - ProteomicsDB",114,32188942,"MaxQuant score",146.5000000,0.7880100,,,,3.3778899677372E-8,
CVSQMVLSR,acy,C,1149,false,"Arabidopsis S-acylation atlas - Meristem",163a,35681017,,,,,,,,
CVSQMVLSR,acy,C,1149,false,"Arabidopsis S-acylation atlas - Silique",163e,35681017,,,,,,,,
