Peptide,PTM,ModifiedAA,ModifiedPosition,PeptideUniqueToGene,ExperimentDesc,ExpID,PubmedID,ScoreType,IdentScore,LocProb,Log2FChange,PQ-val,QuantSig,PEP,MassErrorPPM
RLSSLSLNLSNQPAAIAAR,ph,S,40,true,"Tissue atlas Arabidopsis - ProteomicsDB",114,32188942,"MaxQuant score",208.6100000,0.9756520,,,,0,
LSSLSLNLSNQPAAIAAR,ph,S,41,true,"Tissue atlas Arabidopsis - ProteomicsDB",114,32188942,"MaxQuant score",267.6200000,0.8890960,,,,0,
RRLSSLSLNLSNQPAAIAAR,ph,S,43,true,"TOR Kinase and ABA Receptor",100,29290610,XCorr,4.5311604,0.9885000,,,,0.00051929999608546,
LSSLSLNLSNQPAAIAAR,ph,S,43,true,"TOR Kinase and ABA Receptor",100,29290610,XCorr,4.6434860,0.9783000,,,,9.2129999984536E-7,
LSSLSLNLSNQPAAIAAR,ph,S,43,true,"Tissue atlas Arabidopsis - ProteomicsDB",114,32188942,"MaxQuant score",389.5900000,0.9999530,,,,0,
SKSVSAMGEQAGSSVK,ph,S,60,true,"Large-scale phosphorylation discovery",44,23111157,XCorr,4.5240000,,,,,,
SKSVSAMGEQAGSSVK,ph,S,62,true,"Large-scale phosphorylation discovery",44,23111157,XCorr,3.4680000,,,,,,
SKSVSAMGEQAGSSVK,ph,S,62,true,"atm and atr DNA damage response",88,25561503,"MASCOT Score",84.0000000,0.9400000,,,,,-1.2700000
SKSVSAMGEQAGSSVK,ph,S,62,true,"Tissue atlas Arabidopsis - ProteomicsDB",114,32188942,"MaxQuant score",223.7800000,0.9997730,,,,0,
SVSAMGEQAGSSVK,ph,S,62,true,"atm and atr DNA damage response",88,25561503,"MASCOT Score",80.0000000,1.0000000,,,,,0.7400000
SVSAMGEQAGSSVK,ph,S,62,true,"TOR Kinase and ABA Receptor",100,29290610,XCorr,5.1922164,0.9993000,,,,3.4930000225586E-8,
NFMGPSSEDSLPLSCK,sno,C,141,true,"hot5-4 / wildtype, FAT-switch S-nitrosoproteome",169,37277371,,,,0.2466581,0.0115875,NO,,
