Peptide,PTM,ModifiedAA,ModifiedPosition,PeptideUniqueToGene,ExperimentDesc,ExpID,PubmedID,ScoreType,IdentScore,LocProb,Log2FChange,PQ-val,QuantSig,PEP,MassErrorPPM
GNSCR,myr,G,2,false,"N-Terminal Myristoylated Proteins",102,29453228,,,,,,,,
GSFKDKLDEGDNNKPEDYSK,ph,S,8,true,"PAMP-triggered phosphorylation",48,24601666,"MASCOT Score",32.5700000,,,,,,
TSTTNLSSNSDHSPNAADIIAQEFSK,ph,T,29,true,"Tissue atlas Arabidopsis - ProteomicsDB",114,32188942,"MaxQuant score",162.0000000,0.9671720,,,,0,
TSTTNLSSNSDHSPNAADIIAQEFSK,ph,T,30,true,"Tissue atlas Arabidopsis - ProteomicsDB",114,32188942,"MaxQuant score",128.7100000,0.8057750,,,,6.2586200576471E-35,
TSTTNLSSNSDHSPNAADIIAQEFSK,ph,S,36,true,"Large-scale phosphorylation discovery",44,23111157,XCorr,3.9330000,,,,,,
TSTTNLSSNSDHSPNAADIIAQEFSK,ph,S,36,true,"Tissue atlas Arabidopsis - ProteomicsDB",114,32188942,"MaxQuant score",239.3400000,0.9927170,,,,0,
TSTTNLSSNSDHSPNAADIIAQEFSK,ph,S,39,true,"Tissue atlas Arabidopsis - ProteomicsDB",114,32188942,"MaxQuant score",298.7300000,0.9989150,,,,0,
DNNSNNNSKDPALVIPLREPIMR,ph,S,56,true,"Tissue atlas Arabidopsis - ProteomicsDB",114,32188942,"MaxQuant score",78.3110000,0.9909950,,,,1.8521799916016E-7,
HPWICENGVAPDR,sno,C,356,false,"Site-specific nitrosomeproteomic id - gsnor1-3",90a,25699590,XCorr,2.7367454,,,,,0.014870000071824,-6.2766757
HPWICENGVAPDR,sno,C,356,false,"Site-specific nitrosomeproteomic id - gsnor1-3",90b,25699590,XCorr,2.9400000,,,,,9.942000178853E-5,-7.6900000
HPWICENGVAPDR,so,C,356,false,"Arabidopsis S-sulfenylation chemoproteomics",108,31578252,"pFind PSM Score",0.1063870,,1.1764700,,,,-1.4896772
RTMRNSLNISMRDA,ph,T,544,true,"atm and atr DNA damage response",88,25561503,"MASCOT Score",22.0000000,1.0000000,,,,,-1.2000000
TMRNSLNISMRDA,ph,T,544,true,"srk2dei ABA signaling phopshoproteomics",83,23572148,"MASCOT Score",25.0000000,,,,,,0.0006000
TMRNSLNISMRDA,ph,T,544,true,"atm and atr DNA damage response",88,25561503,"MASCOT Score",27.0000000,1.0000000,,,,,-0.8500000
RTMRNSLNISMR,ph,T,544,true,"atm and atr DNA damage response",88,25561503,"MASCOT Score",30.0000000,1.0000000,,,,,-0.5000000
TMRNSLNISMR,ph,T,544,true,"STN8 phosphoproteome",38,21768351,"MASCOT Score",42.1700000,,,,,,
TMRNSLNISMR,ph,T,544,true,"atm and atr DNA damage response",88,25561503,"MASCOT Score",40.0000000,1.0000000,,,,,-1.1200000
TMRNSLNISMR,ph,T,544,true,"Tissue atlas Arabidopsis - ProteomicsDB",114,32188942,"MaxQuant score",68.4130000,1.0000000,,,,0.0026480499655008,
RTMRNSLNISMRDA,ph,S,548,true,"atm and atr DNA damage response",88,25561503,"MASCOT Score",22.0000000,1.0000000,,,,,-1.2000000
TMRNSLNISMRDA,ph,S,548,true,"srk2dei ABA signaling phopshoproteomics",83,23572148,"MASCOT Score",41.0000000,,,,,,-0.0006000
TMRNSLNISMRDA,ph,S,548,true,"SnRK2 protein kinase substrates",85,23776212,XCorr,2.1054890,0.9970000,,,,0.00057913298951462,
TMRNSLNISMRDA,ph,S,548,true,"atm and atr DNA damage response",88,25561503,"MASCOT Score",28.0000000,0.9750000,,,,,-0.6800000
RTMRNSLNISMR,ph,S,548,true,"atm and atr DNA damage response",88,25561503,"MASCOT Score",30.0000000,1.0000000,,,,,-0.5000000
TMRNSLNISMR,ph,S,548,true,"Phosphoproteome ethylene-regulated time response",46,24043427,"MASCOT Score",26.1200000,,,,,,-35.7149000
TMRNSLNISMR,ph,S,548,true,"Tyrosine phosphorylation in Arabidopsis",59,18463617,"MASCOT Score",24.0000000,,,,,,-0.2140372
TMRNSLNISMR,ph,S,548,true,"Conserved plant phosphoproteome - Arabidopsis",61a,20466843,"MASCOT Score",24.0000000,1.0000000,,,,,
TMRNSLNISMR,ph,S,548,true,"srk2dei ABA signaling phopshoproteomics",83,23572148,"MASCOT Score",20.0000000,,,,,,0.0004000
TMRNSLNISMR,ph,S,548,true,"SnRK2 protein kinase substrates",85,23776212,XCorr,2.5027528,0.9960000,,,,0.026046900078654,
TMRNSLNISMR,ph,S,548,true,"atm and atr DNA damage response",88,25561503,"MASCOT Score",40.0000000,1.0000000,,,,,-1.1200000
TMRNSLNISMR,ph,S,548,true,"Tissue atlas Arabidopsis - ProteomicsDB",114,32188942,"MaxQuant score",153.5100000,1.0000000,,,,7.8899797806287E-10,
NSLNISMRDA,ph,S,548,true,"srk2dei ABA signaling phopshoproteomics",83,23572148,"MASCOT Score",48.0000000,,,,,,0.0001000
NSLNISMRDA,ph,S,548,true,"SnRK2 protein kinase substrates",85,23776212,XCorr,2.1049862,1.0000000,,,,0.0075917900539935,
NSLNISMRDA,ph,S,548,true,"atm and atr DNA damage response",88,25561503,"MASCOT Score",36.0000000,1.0000000,,,,,-0.0100000
NSLNISMR,ph,S,548,false,"Phosphorylation Early Elicitor Signaling",23,17317660,,,,,,,,
NSLNISMR,ph,S,548,false,"Ph protein kinases and peptide chip analysis",27,18433157,,,,,,,,
NSLNISMR,ph,S,548,false,"Tyrosine phosphorylation in Arabidopsis",59,18463617,"MASCOT Score",45.0000000,,,,,,-0.7893940
NSLNISMR,ph,S,548,false,"srk2dei ABA signaling phopshoproteomics",83,23572148,"MASCOT Score",42.0000000,,,,,,0.0002000
NSLNISMR,ph,S,548,false,"atm and atr DNA damage response",88,25561503,"MASCOT Score",46.0000000,1.0000000,,,,,-0.1800000
NSLNISMR,ph,S,548,false,"Phospho cell culture sucrose/TOR",109,30833711,,,1.0000000,,,,,
RTMRNSLNISMRDA,ph,S,552,true,"atm and atr DNA damage response",88,25561503,"MASCOT Score",22.0000000,1.0000000,,,,,-1.2000000
TMRNSLNISMRDA,ph,S,552,true,"srk2dei ABA signaling phopshoproteomics",83,23572148,"MASCOT Score",41.0000000,,,,,,-0.0006000
TMRNSLNISMRDA,ph,S,552,true,"SnRK2 protein kinase substrates",85,23776212,XCorr,2.1054890,1.0000000,,,,0.00057913298951462,
TMRNSLNISMRDA,ph,S,552,true,"atm and atr DNA damage response",88,25561503,"MASCOT Score",28.0000000,0.9750000,,,,,-0.6800000
RTMRNSLNISMR,ph,S,552,true,"atm and atr DNA damage response",88,25561503,"MASCOT Score",30.0000000,1.0000000,,,,,-0.5000000
TMRNSLNISMR,ph,S,552,true,"SnRK2 protein kinase substrates",85,23776212,XCorr,2.5027528,1.0000000,,,,0.026046900078654,
TMRNSLNISMR,ph,S,552,true,"atm and atr DNA damage response",88,25561503,"MASCOT Score",40.0000000,1.0000000,,,,,-0.0800000
TMRNSLNISMR,ph,S,552,true,"Tissue atlas Arabidopsis - ProteomicsDB",114,32188942,"MaxQuant score",174.4000000,1.0000000,,,,6.8858497570545E-7,
NSLNISMRDA,ph,S,552,true,"Arabidopsis root NAA phosphoproteome",18a,27643528,"MaxQuant Score",102.9700000,1.0000000,,,,0.00011500000255182,-0.8840000
NSLNISMRDA,ph,S,552,true,"STN8 phosphoproteome",38,21768351,"MASCOT Score",45.5100000,,,,,,
NSLNISMRDA,ph,S,552,true,"Phosphoproteome ethylene-regulated time response",46,24043427,"MASCOT Score",35.6000000,,,,,,0.0392520
NSLNISMRDA,ph,S,552,true,"PAMP-triggered phosphorylation",48,24601666,"MASCOT Score",36.4500000,,,,,,
NSLNISMRDA,ph,S,552,true,"Tyrosine phosphorylation in Arabidopsis",59,18463617,"MASCOT Score",43.0000000,,,,,,-0.1667361
NSLNISMRDA,ph,S,552,true,"Chloroplast kinase substrates",60,19376835,"MASCOT Score",42.1300000,,,,,,-0.0208478
NSLNISMRDA,ph,S,552,true,"srk2dei ABA signaling phopshoproteomics",83,23572148,"MASCOT Score",60.0000000,,,,,,-0.0001000
NSLNISMRDA,ph,S,552,true,"SnRK2 protein kinase substrates",85,23776212,XCorr,2.4298639,1.0000000,,,,0.015550900250673,
NSLNISMRDA,ph,S,552,true,"atm and atr DNA damage response",88,25561503,"MASCOT Score",38.0000000,1.0000000,,,,,-2.6000000
NSLNISMRDA,ph,S,552,true,"TOR Kinase and ABA Receptor",100,29290610,XCorr,3.6057527,1.0000000,,,,0.0011269999668002,
NSLNISMRDA,ph,S,552,true,"Phospho cell culture sucrose/TOR",109,30833711,,,1.0000000,,,,,
NSLNISMR,ph,S,552,false,"Phosphorylation nuclei-enriched fractions",28,19245862,,,,,,,,
NSLNISMR,ph,S,552,false,"ABA-induced protein phosphorylation",35,20733066,,,,,,,,
NSLNISMR,ph,S,552,false,"Large-scale phosphorylation discovery",44,23111157,XCorr,2.9280000,,,,,,
NSLNISMR,ph,S,552,false,"PAMP-triggered phosphorylation",48,24601666,"MASCOT Score",22.6100000,,,,,,
NSLNISMR,ph,S,552,false,"Tyrosine phosphorylation in Arabidopsis",59,18463617,"MASCOT Score",47.0000000,,,,,,-0.4857053
NSLNISMR,ph,S,552,false,"BSK8 and BSL2 regulating sucrose-ph synthase",66,24924143,"MaxQuant Score",194.1700000,,,,,,-1.2951000
NSLNISMR,ph,S,552,false,"srk2dei ABA signaling phopshoproteomics",83,23572148,"MASCOT Score",49.0000000,,,,,,-0.0011000
NSLNISMR,ph,S,552,false,"SnRK2 protein kinase substrates",85,23776212,XCorr,2.6199737,1.0000000,,,,0.0002800360089168,
NSLNISMR,ph,S,552,false,"SIRK1 phosphorylation",86a,23820729,"MaxQuant Score",156.6200000,1.0000000,,,,0.032000001519918,0.9670000
NSLNISMR,ph,S,552,false,"SIRK1 exp - sirk1 mutant vs WT",86b,23820729,,,,-0.4577347,,NO,,
NSLNISMR,ph,S,552,false,"SIRK1 exp - 35S:SIRK1 vs WT",86c,23820729,,,,1.0240426,,NO,,
NSLNISMR,ph,S,552,false,"atm and atr DNA damage response",88,25561503,"MASCOT Score",45.0000000,1.0000000,,,,,0.3400000
NSLNISMR,ph,S,552,false,"Protein sumoylation and phosphorylation cross-talk",97,28419593,,,,,,,,
NSLNISMR,ph,S,552,false,"TOR Kinase and ABA Receptor",100,29290610,XCorr,3.2208374,1.0000000,,,,0.00039339999784715,
NSLNISMR,ph,S,552,false,"Lateral root-induction - NAA vs control",106,23328941,"MASCOT Score",33.0000000,,,,,,
NSLNISMR,ph,S,552,false,"Col-0 callus - FC Col-0 vs. Col-0 Xray",111a,31410901,,39.5000000,,0.3732269,0.0000000,NO,,-0.1520522
NSLNISMR,ph,S,552,false,"Col-0 X-ray callus - FC Col-0 vs. Col-0 Xray",111b,31410901,,39.5000000,,0.3732269,0.0000000,NO,,-0.1520522
NSLNISMR,ph,S,552,false,"atm callus - FC atm vs. atm Xray",111c,31410901,,39.5000000,,-0.4405894,0.0000000,NO,,-0.1520522
NSLNISMR,ph,S,552,false,"atm-3 X-ray callus - FC atm vs. atm Xray",111d,31410901,,39.5000000,,-0.4405894,0.0000000,NO,,-0.1520522
NSLNISMR,ph,S,552,false,"Touch-induced phosphorylation: 40s touch vs untouc",136,30291188,"MASCOT score",55.5600000,,1.0329635,0.0000416,YES,,-5.8301124
