Peptide,PTM,ModifiedAA,ModifiedPosition,PeptideUniqueToGene,ExperimentDesc,ExpID,PubmedID,ScoreType,IdentScore,LocProb,Log2FChange,PQ-val,QuantSig,PEP,MassErrorPPM
SAAAVNLAPGTPVRPTSILVVGATGTLGR,nta,S,65,true,"Characterization plant N-terminal acetylation",6,22223895,"MASCOT Score",70.8900000,,,,,,
VALIQCAK,sno,C,174,true,"hot5-4 / wildtype, FAT-switch S-nitrosoproteome",169,37277371,,,,-0.6262499,0.0000573,YES,,
YCTEKFLQESGLNHITIR,ac,K,208,true,"Histone deacetylases - apicidin vs control",98a,29061669,"MaxQuant Score",78.7000000,1.0000000,0.1200000,0.6081350,NO,2.9000000317803E-11,
YCTEKFLQESGLNHITIR,ac,K,208,true,"Histone deacetylases - hda14 vs WT (thylakoids)",98d,29061669,"MaxQuant Score",108.7000000,1.0000000,1.0170000,0.6714289,NO,3.2999999166795E-15,
YCTEKFLQESGLNHITIR,ac,K,208,true,"Histone deacetylases substrates - hda14 vs WT",98e,29061669,"MaxQuant Score",185.6000000,1.0000000,0.1090000,0.9099133,NO,0,
AWTTQEVITLCER,sno,C,295,true,"hot5-4 / wildtype, FAT-switch S-nitrosoproteome",169,37277371,,,,0.1747831,0.3525019,NO,,
LKDLKAQSK,ac,K,385,true,"Histone deacetylases - hda14 vs WT (thylakoids)",98d,29061669,"MaxQuant Score",76.3000000,0.9960000,0.2850000,0.8892011,NO,0.003000000026077,
AQSKQSDIYF,ac,K,389,true,"Histone deacetylases - hda14 vs WT (thylakoids)",98d,29061669,"MaxQuant Score",65.3000000,1.0000000,3.4040000,0.1753881,NO,0.0099999997764826,
