Peptide,PTM,ModifiedAA,ModifiedPosition,PeptideUniqueToGene,ExperimentDesc,ExpID,PubmedID,ScoreType,IdentScore,LocProb,Log2FChange,PQ-val,QuantSig,PEP,MassErrorPPM
GCCQSLFSGDNPLGK,myr,G,2,true,"N-Terminal Myristoylated Proteins",102,29453228,,,,,,,,
AATNNFSSDNIVSESGEKAPNLVYK,ub,K,85,true,"Ubiquitination Membrane Proteins",120,33585938,,,,,,,,
AATNNFSSDNIVSESGEKAPNLVYK,ub,K,85,true,"upl3 mutant / wildtype",168,35926874,"MaxQuant score",115.5000000,1.0000000,0.8495990,0.1325380,NO,1.0649099806723E-14,-1.5892000
SYSTNLAYTPPEYLR,ph,S,228,true,"ABA-induced protein phosphorylation",35,20733066,,,,,,,,
SYSTNLAYTPPEYLR,ph,S,228,true,"Large-scale phosphorylation discovery",44,23111157,XCorr,3.3140000,,,,,,
SYSTNLAYTPPEYLR,ph,S,228,true,"Conserved plant phosphoproteome - Arabidopsis",61a,20466843,"MASCOT Score",42.0000000,1.0000000,,,,,
SYSTNLAYTPPEYLR,ph,Y,229,true,"LAXIC - ABA stress",84a,23660473,XCorr,5.0400000,0.8810000,,,,2.1900000035657E-8,
SYSTNLAYTPPEYLR,ph,S,230,true,"Sucrose-induced phosphorylation",24,17586839,,,,,,,,
SYSTNLAYTPPEYLR,ph,S,230,true,"Plasmembrane Ph Immune Responses",25,17651370,,,,,,,,
SYSTNLAYTPPEYLR,ph,S,230,true,"Large-scale phosphorylation discovery",44,23111157,XCorr,4.2270000,,,,,,
SYSTNLAYTPPEYLR,ph,S,230,true,"Tissue atlas Arabidopsis - ProteomicsDB",114,32188942,"MaxQuant score",310.7400000,0.9997290,,,,0,
DGKSYSTNLAYTPPEYLR,ph,T,231,true,"Phosphoproteome ethylene-regulated time response",46,24043427,"MASCOT Score",28.6500000,,,,,,-7.7146000
SYSTNLAYTPPEYLR,ph,T,231,true,"SnRK2 protein kinase substrates",85,23776212,XCorr,2.7684412,0.9830000,,,,0.00552326021716,
CLQYEPR,sno,C,309,false,"hot5-4 / wildtype, FAT-switch S-nitrosoproteome",169,37277371,,,,,,,,
KQEEAPSTPQRPLSPLGEACSR,ph,S,352,true,"Large-scale phosphorylation discovery",44,23111157,XCorr,3.9910000,,,,,,
KQEEAPSTPQRPLSPLGEACSR,ph,T,353,true,"STN8 phosphoproteome",38,21768351,"MASCOT Score",46.8200000,,,,,,
KQEEAPSTPQRPLSPLGEACSR,ph,T,353,true,"Phosphoproteome ethylene-regulated time response",46,24043427,"MASCOT Score",50.1300000,,,,,,-16.8179000
KQEEAPSTPQRPLSPLGEACSR,ph,T,353,true,"Chloroplast kinase substrates",60,19376835,"MASCOT Score",38.4300000,,,,,,-0.5990980
KQEEAPSTPQRPLSPLGEACSR,ph,T,353,true,"atm and atr DNA damage response",88,25561503,"MASCOT Score",30.0000000,0.9920000,,,,,-0.7800000
KQEEAPSTPQRPLSPLGEACSR,ph,T,353,true,"TOR Kinase and ABA Receptor",100,29290610,XCorr,3.6143966,0.8730000,,,,0.00091539998538792,
KQEEAPSTPQRPLSPLGEACSR,ph,T,353,true,"Col-0 callus - FC Col-0 vs. Col-0 Xray",111a,31410901,,26.3300000,,0.1586353,0.0000000,NO,,0.9781621
KQEEAPSTPQRPLSPLGEACSR,ph,T,353,true,"Col-0 X-ray callus - FC Col-0 vs. Col-0 Xray",111b,31410901,,26.3300000,,0.1586353,0.0000000,NO,,0.9781621
KQEEAPSTPQRPLSPLGEACSR,ph,T,353,true,"atm callus - FC atm vs. atm Xray",111c,31410901,,26.3300000,,0.7305605,0.0000000,NO,,0.9781621
KQEEAPSTPQRPLSPLGEACSR,ph,T,353,true,"atm-3 X-ray callus - FC atm vs. atm Xray",111d,31410901,,26.3300000,,0.7305605,0.0000000,NO,,0.9781621
KQEEAPSTPQRPLSPLGEACSR,ph,T,353,true,"Tissue atlas Arabidopsis - ProteomicsDB",114,32188942,"MaxQuant score",256.5600000,0.9997210,,,,0,
QEEAPSTPQRPLSPLGEACSR,ph,T,353,true,"STN8 phosphoproteome",38,21768351,"MASCOT Score",51.5900000,,,,,,
QEEAPSTPQRPLSPLGEACSR,ph,T,353,true,"atm and atr DNA damage response",88,25561503,"MASCOT Score",24.0000000,0.9170000,,,,,-0.0100000
QEEAPSTPQRPLSPLGEACSR,ph,T,353,true,"Col-0 callus - FC Col-0 vs. Col-0 Xray",111a,31410901,,24.3600000,,0.3154711,0.0000000,NO,,0.0308830
QEEAPSTPQRPLSPLGEACSR,ph,T,353,true,"Col-0 X-ray callus - FC Col-0 vs. Col-0 Xray",111b,31410901,,24.3600000,,0.3154711,0.0000000,NO,,0.0308830
QEEAPSTPQRPLSPLGEACSR,ph,T,353,true,"atm callus - FC atm vs. atm Xray",111c,31410901,,24.3600000,,0.7636047,0.0000000,NO,,0.0308830
QEEAPSTPQRPLSPLGEACSR,ph,T,353,true,"atm-3 X-ray callus - FC atm vs. atm Xray",111d,31410901,,24.3600000,,0.7636047,0.0000000,NO,,0.0308830
KQEEAPSTPQR,ph,T,353,true,"atm and atr DNA damage response",88,25561503,"MASCOT Score",40.0000000,1.0000000,,,,,0.2200000
QEEAPSTPQRPLSPLGEACSR,sno,C,365,true,"hot5-4 / wildtype, FAT-switch S-nitrosoproteome",169,37277371,,,,,,,,
QEEAPSTPQRPLSPLGEACSR,ph,S,366,true,"TOR Kinase and ABA Receptor",100,29290610,XCorr,2.2693334,0.9989000,,,,0.020870000123978,
DDEGTNELSFQEWTQQMK,ph,S,392,true,"Tissue atlas Arabidopsis - ProteomicsDB",114,32188942,"MaxQuant score",418.7500000,1.0000000,,,,0,
LNMNTDAADMLNEAAQLEEKR,ac,K,504,true,"Quantitative Acetylproteomics",101,29440448,,,,,,,,
