Peptide,PTM,ModifiedAA,ModifiedPosition,PeptideUniqueToGene,ExperimentDesc,ExpID,PubmedID,ScoreType,IdentScore,LocProb,Log2FChange,PQ-val,QuantSig,PEP,MassErrorPPM
SNAYPSIPGTAPIDGGFTDELKPIRR,nt,S,25,true,"HUNTER N-terminome: legumain, GluC and trypsin",119,31951383,"MaxQuant score",51.3980000,,,,,,
SNAYPSIPGTAPIDGGFTDELKPIR,nt,S,25,true,"HUNTER N-terminome: legumain, GluC and trypsin",119,31951383,"MaxQuant score",85.3710000,,,,,,
SNAYPSIPGTAPIDGGFTDE,nt,S,25,true,"Arg/N-end rule seed, prt6 vs. Wt",99,29168982,"MASCOT Score",25.0700000,,-0.8226683,0.1768643,NO,0.03728000074625,2.9454274
SNAYPSIPGTAPIDGGFTDE,nt,S,25,true,"HUNTER N-terminome: legumain, GluC and trypsin",119,31951383,"MaxQuant score",152.0000000,,,,,,
SNAYPSIPGTAPIDGGFTD,nt,S,25,true,"HUNTER N-terminome: legumain, GluC and trypsin",119,31951383,"MaxQuant score",56.9510000,,,,,,
NGSLANNSEMK,ng,N,90,true,"Conserved N-glycosylation",74,22633491,"MaxQuant Score",69.6920000,0.9400000,,,,0.0070000002160668,0.9930000
NGSLANNSEMK,ng,N,90,true,"N-Glycopeptide Profiling in Arabidopsis Infloresce",132,27067053,"MOWSE score",36.1000000,,,,,0.00050000002374873,
DKNITAEVMK,ng,N,148,true,"N-glycan occupancy Arabidopsis glycoproteins",87,23994444,"Ladder score",54.4000000,,,,,,
DKNITAEVMK,ng,N,148,true,"N-Glycopeptide Profiling in Arabidopsis Infloresce",132,27067053,"MOWSE score",24.5000000,,,,,0.039000000804663,
DKNITAEVMK,ng,N,148,true,"N-linked Glycan Micro-heterogeneity Arabidopsis",134,29237727,,,,,,,,
NITAEVMK,ng,N,148,true,"Conserved N-glycosylation",74,22633491,"MaxQuant Score",160.5400000,1.0000000,,,,4.9740000312992E-11,1.8470000
