Peptide,PTM,ModifiedAA,ModifiedPosition,PeptideUniqueToGene,ExperimentDesc,ExpID,PubmedID,ScoreType,IdentScore,LocProb,Log2FChange,PQ-val,QuantSig,PEP,MassErrorPPM
MDPYKYRPASSYNSPFFTTNSGAPVWNNNSSMTVGPR,nta,M,1,true,"HUNTER N-terminome: legumain, GluC and trypsin",119,31951383,"MaxQuant score",71.5960000,,,,,,
MDPYKYRPASSYNSPFFTTNSG,nta,M,1,true,"Arg/N-end rule seed, prt6 vs. Wt",99,29168982,"MASCOT Score",21.3500000,,-0.0776258,0.9102060,NO,8.6849999206606E-5,-1.1712052
MDPYKYRPASSYN,nta,M,1,true,"HUNTER N-terminome: legumain, GluC and trypsin",119,31951383,"MaxQuant score",87.2980000,,,,,,
MDPYKYRPASSY,nta,M,1,true,"Arg/N-end rule pathway Roots",80,25728785,"MASCOT Score",37.8500000,,,,,0.010520000010729,
MDPYKYRPAS,nta,M,1,true,"N-term acetylation drought responses",5,26184543,,,,,,,,
GPILLEDYHLVEKLANFDR,ac,K,50,true,"Histone deacetylases - apicidin vs control",98a,29061669,"MaxQuant Score",160.6000000,1.0000000,0.0480000,0.8317638,NO,0,
GPILLEDYHLVEKLANFDR,ac,K,50,true,"Histone deacetylases substrates - TSA vs control",98b,29061669,"MaxQuant Score",160.6000000,1.0000000,-2.1380000,0.4965923,NO,0,
HDISNLTCADFLR,nta,H,79,false,"FtsH12 N-terminome: WT / FtsH12 knockdown miRNA",118,33216923,"MaxQuant score",67.8460000,,,,,1.0300000212737E-5,
GFFEVTHDISNLTCADFLR,ph,T,85,false,"Phosphorylation in N starvation",63,22060019,"MASCOT Score",24.0000000,,,,,,0.2076850
GFFEVTHDISNLTCADFLR,sno,C,86,false,"Cold stress nitrosylation - 4°C vs 22°C",65,24388526,,,,,,,,
GFFEVTHDISNLTCADFLR,sno,C,86,false,"Site-specific nitrosomeproteomic id - gsnor1-3",90a,25699590,XCorr,4.7600000,,,,,0.0066929999738932,-4.1400000
GFFEVTHDISNLTCADFLR,sno,C,86,false,"Site-specific nitrosomeproteomic id - gsnor1-3",90b,25699590,XCorr,5.1100000,,,,,0.00088920001871884,-3.3700000
APGVQTPVIVR,nt,A,92,false,"Arg/N-end rule seed, prt6 vs. Wt",99,29168982,"MASCOT Score",35.6900000,,,,,0.074600003659725,-0.8013589
GFAVKFYTR,ac,K,125,false,"Histone deacetylases - apicidin vs control",98a,29061669,"MaxQuant Score",119.5000000,1.0000000,0.0140000,0.9462372,NO,0.0070000002160668,
LVGNNFPVFFIR,nt,L,135,true,"N-terminal ChaFRADIC",92,26010716,"MASCOT Score",54.3200000,,,,,1.0070000371343E-6,
SLNMFTFLFDD,nt,S,182,true,"N-terminal ChaFRADIC",92,26010716,"MASCOT Score",36.7800000,,,,,0.00013099999341648,
LFDDIGIPQDYR,nt,L,189,true,"Arg/N-end rule seed, prt6 vs. Wt",99,29168982,"MASCOT Score",47.0900000,,-0.7448482,0.0092481,NO,0.0012900000438094,-1.7126701
FHWKPTCGVK,ac,K,227,true,"Histone deacetylases substrates - TSA vs control",98b,29061669,"MaxQuant Score",50.4000000,1.0000000,0.8140000,0.6561453,NO,0.0040000001899898,
FHWKPTCGVK,sno,C,230,true,"Site-specific nitrosomeproteomic id - gsnor1-3",90b,25699590,XCorr,2.2300000,,,,,0.26739999651909,-6.9800000
SLLEEDAIR,nt,S,234,true,"Arg/N-end rule seed, prt6 vs. Wt",99,29168982,"MASCOT Score",51.9800000,,-0.3140580,0.4418719,NO,0.0063129998743534,-1.2634868
SIAAGNYPE,nt,S,258,true,"N-terminal ChaFRADIC",92,26010716,"MASCOT Score",46.7400000,,,,,0.0094929998740554,
CAHHNNHHEGFMNFMHR,sno,C,370,false,"Site-specific nitrosomeproteomic id - gsnor1-3",90b,25699590,XCorr,2.3400000,,,,,9.9389999377308E-6,-6.2700000
HAEKYPTPPAVCSGK,ph,T,408,true,"Tissue atlas Arabidopsis - ProteomicsDB",114,32188942,"MaxQuant score",111.4500000,0.9999990,,,,2.4650601062604E-6,
HAEKYPTPPAVCSGK,sno,C,413,true,"Site-specific nitrosomeproteomic id - gsnor1-3",90a,25699590,XCorr,3.0674267,,,,,0.25189998745918,-6.5436340
HAEKYPTPPAVCSGK,sno,C,413,true,"Site-specific nitrosomeproteomic id - gsnor1-3",90b,25699590,XCorr,3.5100000,,,,,0.066610001027584,-5.2200000
YPTPPAVCSGK,sno,C,413,true,"Cold stress nitrosylation - 4°C vs 22°C",65,24388526,,,,,,,,
YPTPPAVCSGK,sno,C,413,true,"Site-specific nitrosomeproteomic id - gsnor1-3",90a,25699590,XCorr,2.8294756,,,,,0.00034389999927953,-6.4105609
YPTPPAVCSGK,sno,C,413,true,"Site-specific nitrosomeproteomic id - gsnor1-3",90b,25699590,XCorr,2.1519139,,,,,0.2272000014782,-6.9545707
YPTPPAVCSGK,sno,C,413,true,"hot5-4 / wildtype, FAT-switch S-nitrosoproteome",169,37277371,,,,-0.4596443,0.2068160,NO,,
CIIEKENNFKEPGER,nt,C,420,true,"Metacaspase9 substrates - in vitro rMC9",51c,23964026,"MASCOT Score",57.0000000,,2.2635187,,NO,,-0.4826195
TFTPERQER,ph,T,439,true,"TOR Kinase and ABA Receptor",100,29290610,XCorr,2.6170287,0.9995000,,,,0.0097719999030232,
TFTPERQER,ph,T,439,true,"Tissue atlas Arabidopsis - ProteomicsDB",114,32188942,"MaxQuant score",91.9610000,0.9999810,,,,0.0009456219850108,
SLGQKLASR,ac,K,481,false,"Histone deacetylases - apicidin vs control",98a,29061669,"MaxQuant Score",99.8000000,1.0000000,-0.1250000,0.4677351,NO,0.0040000001899898,
LASRLNVRPSI,ph,S,484,false,"Tissue atlas Arabidopsis - ProteomicsDB",114,32188942,"MaxQuant score",71.5060000,0.9999930,,,,0.0070018600672483,
LNVRPSI,ph,S,491,false,"srk2dei ABA signaling phopshoproteomics",83,23572148,"MASCOT Score",32.0000000,,,,,,0.0000000
LNVRPSI,ph,S,491,false,"TOR Kinase and ABA Receptor",100,29290610,XCorr,2.9836392,1.0000000,,,,0.0011690000537783,
