Peptide,PTM,ModifiedAA,ModifiedPosition,PeptideUniqueToGene,ExperimentDesc,ExpID,PubmedID,ScoreType,IdentScore,LocProb,Log2FChange,PQ-val,QuantSig,PEP,MassErrorPPM
AAPIVDAEYLKEITKAR,nt,A,2,true,"N-terminal ChaFRADIC",92,26010716,"MASCOT Score",33.7000000,,,,,3.2569998438703E-5,
AAPIVDAEYLKEITKAR,nt,A,2,true,"Stromal N-terminome",96,26371235,"MASCOT Score",33.0500000,,,,,,
AAPIVDAEYLKEITKAR,nt,A,2,true,"Arg/N-end rule seed, prt6 vs. Wt",99,29168982,"MASCOT Score",32.0300000,,,,,0.014560000039637,0.6873352
AAPIVDAEYLKEITKAR,nt,A,2,true,"FtsH12 N-terminome: WT / FtsH12 knockdown miRNA",118,33216923,"MaxQuant score",60.4720000,,,,,1.0599999768601E-5,
AAPIVDAEYLKE,nt,A,2,true,"N-terminal ChaFRADIC",92,26010716,"MASCOT Score",77.7800000,,,,,0.00031979999039322,
AAPIVDAEYLKE,nt,A,2,true,"Arg/N-end rule seed, prt6 vs. Wt",99,29168982,"MASCOT Score",53.0800000,,,,,0.02119000069797,-0.6872148
AAPIVDAEYL,nt,A,2,true,"N-term acetylation drought responses",5,26184543,,,,,,,,
AAPIVDAEYLKEITKARREL,nta,A,2,true,"Arabidopsis translation initiation landscape - NTA",167a,35069635,,,,,,,,
AAPIVDAEYLKEITKAR,nta,A,2,true,"Arg/N-end rule pathway Roots",80,25728785,"MASCOT Score",65.4100000,,,,,1.7269999830205E-7,
AAPIVDAEYLKEITKAR,nta,A,2,true,"N-terminal ChaFRADIC",92,26010716,"MASCOT Score",33.7000000,,,,,3.2569998438703E-5,
AAPIVDAEYLKEITKAR,nta,A,2,true,"Stromal N-terminome",96,26371235,"MASCOT Score",33.0500000,,,,,,
AAPIVDAEYLKEITKAR,nta,A,2,true,"Arg/N-end rule seed, prt6 vs. Wt",99,29168982,"MASCOT Score",32.0300000,,0.5678583,0.0515097,NO,0.014560000039637,0.6873352
AAPIVDAEYLKEITKAR,nta,A,2,true,"HUNTER N-terminome: legumain, GluC and trypsin",119,31951383,"MaxQuant score",82.2480000,,,,,,
AAPIVDAEYLKE,nta,A,2,true,"N-terminal ChaFRADIC",92,26010716,"MASCOT Score",77.7800000,,,,,0.00031979999039322,
AAPIVDAEYLKE,nta,A,2,true,"Arg/N-end rule seed, prt6 vs. Wt",99,29168982,"MASCOT Score",53.0800000,,0.7215631,0.0651782,NO,0.02119000069797,-0.6872148
AAPIVDAEYLK,nta,A,2,true,"Characterization plant N-terminal acetylation",6,22223895,"MASCOT Score",68.7700000,,,,,,
AAPIVDAEYL,nta,A,2,true,"N-term acetylation drought responses",5,26184543,,,,,,,,
AAPIVDAE,nta,A,2,true,"HUNTER N-terminome: legumain, GluC and trypsin",119,31951383,"MaxQuant score",132.7200000,,,,,,
AAPIVDAEYLKEITKAR,ub,K,12,true,"Arabidopsis ubiquitination COFRADIC",40,26744219,"MaxQuant Score",52.8620000,1.0000000,,,,5.2449999202508E-5,0.4240000
AAPIVDAEYLKEITKAR,ub,K,16,true,"Arabidopsis ubiquitination COFRADIC",40,26744219,"MaxQuant Score",52.8620000,1.0000000,,,,5.2449999202508E-5,0.4240000
NCAPIMLR,acy,C,30,false,"Arabidopsis S-acylation atlas - Meristem",163a,35681017,,,,,,,,
NCAPIMLR,acy,C,30,false,"Arabidopsis S-acylation atlas - Silique",163e,35681017,,,,,,,,
NCAPIMLR,ox,C,30,false,"OxiTRAQ Arabidopsis - 5 mM H2O2 versus control",47,24376095,,,,0.4434636,0.0245643,YES,,
NCAPIMLR,ox,C,30,false,"Bicarbonate Induced Redox Changes - 5 min",117a,28184230,,,,-0.1202942,,YES,,
WHDAGTYDAQSKTGGPNGSIR,nt,W,39,true,"FtsH12 N-terminome: WT / FtsH12 knockdown miRNA",118,33216923,"MaxQuant score",74.3640000,,,,,9.0700001464938E-7,
IALDLCEGVK,sno,C,79,true,"hot5-4 / wildtype, FAT-switch S-nitrosoproteome",169,37277371,,,,0.8340764,0.0077936,YES,,
DSNVCPK,ox,C,123,true,"SPEAR - 10 mM H2O2 / mock",138a,34619326,,,,0.9695645,0.0191778,YES,,
DSNVCPK,sno,C,123,true,"hot5-4 / wildtype, FAT-switch S-nitrosoproteome",169,37277371,,,,0.3909447,0.0509385,NO,,
LPTDKTLLEDPEFR,ac,K,206,true,"Quantitative Acetylproteomics",101,29440448,,,,,,,,
LVELYAKDEDAFFR,ub,K,223,true,"upl3 mutant / wildtype",168,35926874,"MaxQuant score",54.8980000,1.0000000,0.7022143,,,0.00088251999113709,-0.5696700
