Peptide,PTM,ModifiedAA,ModifiedPosition,PeptideUniqueToGene,ExperimentDesc,ExpID,PubmedID,ScoreType,IdentScore,LocProb,Log2FChange,PQ-val,QuantSig,PEP,MassErrorPPM
SNPRVFFD,nta,S,2,true,"HUNTER N-terminome: legumain, GluC and trypsin",119,31951383,"MaxQuant score",154.7100000,,,,,,
SNPRVFFD,nta,S,2,true,"Arabidopsis translation initiation landscape - NTA",167a,35069635,,,,,,,,
SLSGTPIGRIE,nt,S,11,true,"Arg/N-end rule seed, prt6 vs. Wt",99,29168982,"MASCOT Score",38.8600000,,-0.5035090,0.5756108,NO,2.4330000087502E-5,-1.5626343
VFFDMSLSGTPIGR,ph,S,13,true,"Tissue atlas Arabidopsis - ProteomicsDB",114,32188942,"MaxQuant score",151.2200000,0.8461490,,,,5.7424600186096E-8,
VFFDMSLSGTPIGR,ph,T,15,true,"Tissue atlas Arabidopsis - ProteomicsDB",114,32188942,"MaxQuant score",192.4000000,0.9966350,,,,1.5901100162669E-31,
FADTTPNTAENFR,nt,F,25,true,"Arg/N-end rule seed, prt6 vs. Wt",99,29168982,"MASCOT Score",61.3100000,,0.0848163,0.9659561,NO,0.01541000045836,-0.0250675
FADTTPNTAE,nt,F,25,true,"Arg/N-end rule seed, prt6 vs. Wt",99,29168982,"MASCOT Score",24.9100000,,0.0503123,0.9001737,NO,0.063629999756813,-3.3623598
ALCTGEK,ox,C,40,false,"OxiTRAQ Arabidopsis - 5 mM H2O2 versus control",47,24376095,,,,-0.1553836,0.4914629,NO,,
ALCTGEK,sno,C,40,false,"hot5-4 / wildtype, FAT-switch S-nitrosoproteome",169,37277371,,,,,,,,
ALCTGEK,so,C,40,false,"Arabidopsis S-sulfenylation chemoproteomics",108,31578252,"pFind PSM Score",0.0736608,,0.9177400,,,,-0.0130946
ALCTGEK,so,C,40,false,"S-sulfenylation site detection using YAP1C",110,32714340,,,,,,,,
LGKPLHFK,ac,K,51,true,"Quantitative Acetylproteomics",101,29440448,,,,,,,,
VIPGFMCQGGDFTAK,cn,C,69,true,"Cellular regulation by S-cyanylation",115,30377236,,,,,,,,
VIPGFMCQGGDFTAK,ox,C,69,true,"SPEAR - 10 mM H2O2 / mock",138a,34619326,,,,2.7058890,0.0068974,YES,,
VIPGFMCQGGDFTAK,so,C,69,true,"S-sulfenylation site detection using YAP1C",110,32714340,,,,,,,,
QGGDFTAKNGTGGE,nt,Q,70,true,"Arg/N-end rule seed, prt6 vs. Wt",99,29168982,"MASCOT Score",38.9600000,,-0.3889002,0.0034546,NO,7.7770000643795E-6,-1.0431692
NGTGGESIYGAK,ng,N,78,false,"Conserved N-glycosylation",74,22633491,"MaxQuant Score",112.4600000,1.0000000,,,,7.5099997332018E-8,0.4180000
NGTGGESIYGAKFK,ac,K,89,true,"Quantitative Acetylproteomics",101,29440448,,,,,,,,
FKDENFIK,ub,K,91,false,"upl3 mutant / wildtype",168,35926874,"MaxQuant score",74.2670000,1.0000000,-0.9770996,0.4512400,NO,0.01377599965781,0.1452700
FKDENFIKK,ac,K,97,false,"Quantitative Acetylproteomics",101,29440448,,,,,,,,
SMANSGPNTNGSQFF,nt,S,106,false,"Arabidopsis translation initiation landscape - NT",167b,35069635,,,,,,,,
TSWLDGKHVVFGQVVK,ub,K,132,true,"upl3 mutant / wildtype",168,35926874,"MaxQuant score",95.6590000,1.0000000,-0.6850135,,,6.6218200345247E-7,0.0020946
HVVFGQVVKGLDVVK,ub,K,141,true,"upl3 mutant / wildtype",168,35926874,"MaxQuant score",94.0900000,1.0000000,,,,1.6126000446093E-6,-0.7637100
GLDVVKAIEK,ac,K,147,false,"Histone deacetylases - apicidin vs control",98a,29061669,"MaxQuant Score",148.2000000,1.0000000,0.1570000,0.5395106,NO,0.0020000000949949,
GLDVVKAIEK,ac,K,147,false,"Histone deacetylases substrates - hda14 vs WT",98e,29061669,"MaxQuant Score",77.1000000,1.0000000,-0.1370000,0.8709636,NO,0.00044999999227002,
GLDVVKAIEK,ac,K,147,false,"Quantitative Acetylproteomics",101,29440448,,,,,,,,
GLDVVKAIEK,ub,K,147,false,"upl3 mutant / wildtype",168,35926874,"MaxQuant score",73.9000000,1.0000000,-0.4441838,,,0.0014682000037283,-1.4202000
AIEKVGSDSGK,ac,K,151,true,"Histone deacetylases - apicidin vs control",98a,29061669,"MaxQuant Score",56.2000000,1.0000000,-0.1460000,0.5445027,NO,0.0049999998882413,
TSKVVTITDCGQLS,ub,K,161,true,"upl3 mutant / wildtype",168,35926874,"MaxQuant score",89.4710000,1.0000000,0.3459640,0.5233400,NO,4.4692700612359E-5,0.2321400
VVTITDCGQLS,so,C,168,true,"S-sulfenylation site detection using YAP1C",110,32714340,,,,,,,,
