Peptide,PTM,ModifiedAA,ModifiedPosition,PeptideUniqueToGene,ExperimentDesc,ExpID,PubmedID,ScoreType,IdentScore,LocProb,Log2FChange,PQ-val,QuantSig,PEP,MassErrorPPM
AVGKNKRISKGRKGGKKKAV,nt,A,2,false,"Arabidopsis translation initiation landscape - NT",167b,35069635,,,,,,,,
AVGKNKRISK,nt,A,2,false,"N-term acetylation drought responses",5,26184543,,,,,,,,
AVGKNKR,nt,A,2,false,"Arabidopsis ubiquitination COFRADIC",40,26744219,"MaxQuant Score",75.3110000,,,,,0.013000000268221,0.7050000
AVGKNKR,nub,A,2,false,"Arabidopsis ubiquitination COFRADIC",40,26744219,"MaxQuant Score",75.3110000,,,,,0.013000000268221,0.7050000
AVGKNKR,ub,K,5,false,"Arabidopsis ubiquitination COFRADIC",40,26744219,"MaxQuant Score",75.3110000,1.0000000,,,,0.013000000268221,0.7050000
AVGKNKR,ub,K,7,false,"Arabidopsis ubiquitination COFRADIC",40,26744219,"MaxQuant Score",75.3110000,1.0000000,,,,0.013000000268221,0.7050000
APGSFTNR,ph,S,37,true,"STN8 phosphoproteome",38,21768351,"MASCOT Score",46.4800000,,,,,,-0.3980920
APGSFTNR,ph,S,37,true,"Tissue atlas Arabidopsis - ProteomicsDB",114,32188942,"MaxQuant score",101.9700000,0.9950530,,,,0.0047964099794626,
NVGKTLVSR,nt,N,42,false,"Arabidopsis translation initiation landscape - NT",167b,35069635,,,,,,,,
NVGKTLVSR,ac,K,45,false,"Histone deacetylases - apicidin vs control",98a,29061669,"MaxQuant Score",89.6000000,1.0000000,-0.1400000,0.4017908,NO,0.0060000000521541,
NVGKTLVSR,ac,K,45,false,"Quantitative Acetylproteomics",101,29440448,,,,,,,,
NVGKTLVSR,ub,K,45,false,"Ubiquitination Membrane Proteins",120,33585938,,,,,,,,
NVGKTLVSR,ub,K,45,false,"upl3 mutant / wildtype",168,35926874,"MaxQuant score",113.6200000,1.0000000,1.3801753,0.0543010,NO,0.00036551599623635,0.6248800
TQGTKIASEGLKHR,nt,T,51,false,"Arabidopsis translation initiation landscape - NT",167b,35069635,,,,,,,,
TQGTKIASEGLK,ac,K,55,false,"Quantitative Acetylproteomics",101,29440448,,,,,,,,
TQGTKIASEGLKHR,ub,K,55,false,"Arabidopsis ubiquitination COFRADIC",40,26744219,"MaxQuant Score",46.3180000,1.0000000,,,,0.0010000000474975,-1.3050000
IASEGLKHR,ac,K,62,false,"Quantitative Acetylproteomics",101,29440448,,,,,,,,
TQGTKIASEGLKHR,ub,K,62,false,"Arabidopsis ubiquitination COFRADIC",40,26744219,"MaxQuant Score",68.9720000,1.0000000,,,,6.5449997851963E-12,-0.3490000
IASEGLKHR,ub,K,62,false,"Ubiquitination Membrane Proteins",120,33585938,,,,,,,,
ADLQNDEDNAYR,nt,A,71,true,"Arabidopsis translation initiation landscape - NT",167b,35069635,,,,,,,,
TCYAQSSQIR,acy,C,154,false,"Arabidopsis S-acylation atlas - Silique",163e,35681017,,,,,,,,
TCYAQSSQIR,ox,C,154,false,"OxiTRAQ Arabidopsis - 5 mM H2O2 versus control",47,24376095,,,,0.1869099,0.0532282,NO,,
TCYAQSSQIR,sno,C,154,false,"hot5-4 / wildtype, FAT-switch S-nitrosoproteome",169,37277371,,,,,,,,
TCYAQSSQIR,so,C,154,false,"Arabidopsis S-sulfenylation chemoproteomics",108,31578252,"pFind PSM Score",0.1010120,,0.8146200,,,,-1.3335943
TCYAQSSQIR,so,C,154,false,"S-sulfenylation site detection using YAP1C",110,32714340,,,,,,,,
YAQSSQIR,nt,Y,155,false,"Arg/N-end rule seed, prt6 vs. Wt",99,29168982,"MASCOT Score",37.3600000,,,,,0.093319997191429,-2.1632300
TCYAQSSQIR,ph,S,159,false,"Tissue atlas Arabidopsis - ProteomicsDB",114,32188942,"MaxQuant score",111.5000000,0.9317180,,,,0.00020956000662409,
KMSEIMVK,ph,S,169,true,"atm and atr DNA damage response",88,25561503,"MASCOT Score",31.0000000,1.0000000,,,,,-3.8100000
EASSCDLK,ph,S,177,false,"SnRK2 protein kinase substrates",85,23776212,XCorr,2.4558783,0.9470000,,,,0.07566549628973,
EASSCDLK,ph,S,177,false,"atm and atr DNA damage response",88,25561503,"MASCOT Score",29.0000000,0.9540000,,,,,-2.5200000
EASSCDLKELVAK,acy,C,179,true,"Arabidopsis S-acylation atlas - Meristem",163a,35681017,,,,,,,,
EASSCDLK,ox,C,179,false,"OxiTRAQ Arabidopsis - 5 mM H2O2 versus control",47,24376095,,,,0.0166644,0.1131350,NO,,
EASSCDLK,sno,C,179,false,"hot5-4 / wildtype, FAT-switch S-nitrosoproteome",169,37277371,,,,,,,,
EASSCDLKELVAK,so,C,179,true,"S-sulfenylation site detection using YAP1C",110,32714340,,,,,,,,
ELVAKFIPEAIGR,ac,K,187,true,"Quantitative Acetylproteomics",101,29440448,,,,,,,,
EIEKATQGIYPLQNVFIR,nt,E,196,false,"Arabidopsis translation initiation landscape - NT",167b,35069635,,,,,,,,
APKFDLGK,ac,K,222,false,"Quantitative Acetylproteomics",101,29440448,,,,,,,,
VDRPADETMVEEPTEIIGA,ph,T,251,true,"Tissue atlas Arabidopsis - ProteomicsDB",114,32188942,"MaxQuant score",80.9750000,0.9999960,,,,0.0004696249961853,
VDRPADETMVEEPTEIIGA,ph,T,257,true,"Tissue atlas Arabidopsis - ProteomicsDB",114,32188942,"MaxQuant score",89.2610000,0.9999310,,,,0.00010328600183129,
