Peptide,PTM,ModifiedAA,ModifiedPosition,PeptideUniqueToGene,ExperimentDesc,ExpID,PubmedID,ScoreType,IdentScore,LocProb,Log2FChange,PQ-val,QuantSig,PEP,MassErrorPPM
SSGDENAPSPSVVMDSDFDAKVFR,nt,S,40,true,"Arg/N-end rule pathway Roots",80,25728785,"MASCOT Score",42.7300000,,,,,0.00060999998822808,
SSGDENAPSPSVVMDSDFDAKVFR,nt,S,40,true,"N-terminal ChaFRADIC",92,26010716,"MASCOT Score",43.5500000,,,,,2.7170000190674E-12,
SSGDENAPSPSVVMDSDFDAKVFR,nt,S,40,true,"Stromal N-terminome",96,26371235,"MASCOT Score",72.2600000,,,,,,
SSGDENAPSPSVVMDSDFDAKVFR,nt,S,40,true,"Arg/N-end rule seed, prt6 vs. Wt",99,29168982,"MASCOT Score",31.1200000,,0.0286317,0.9141500,NO,0.00032689998624846,-1.1993544
SSGDENAPSPSVVMDSDFDAKVFR,nt,S,40,true,"HUNTER N-terminome: legumain, GluC and trypsin",119,31951383,"MaxQuant score",102.9700000,,,,,,
SSGDENAPSPSVVMDSDFDAKVFR,nt,S,40,true,"Arabidopsis translation initiation landscape - NT",167b,35069635,,,,,,,,
SSGDENAPSPS,nt,S,40,true,"N-terminal ChaFRADIC",92,26010716,"MASCOT Score",82.3800000,,,,,1.5100000139157E-9,
SGDENAPSPSVVMDSDFDAKVFR,nt,S,41,true,"HUNTER N-terminome: legumain, GluC and trypsin",119,31951383,"MaxQuant score",62.6840000,,,,,,
SGDENAPSPSVVMDSDFDAKVFR,nt,S,41,true,"Arabidopsis translation initiation landscape - NT",167b,35069635,,,,,,,,
SGDENAPSPS,nt,S,41,true,"N-terminal ChaFRADIC",92,26010716,"MASCOT Score",44.0700000,,,,,4.0560000343248E-5,
RLEDMDVK,mox,M,163,true,"cat2 Methionine oxidation - 1h stress",62a,25693801,"MASCOT Score",37.0000000,,0.1856487,,NO,,
VQIVDTTCPWVTK,sno,C,213,true,"Site-specific nitrosomeproteomic id - gsnor1-3",90a,25699590,XCorr,3.4839520,,,,,0.0001129000011133,-5.2302466
VQIVDTTCPWVTK,sno,C,213,true,"Site-specific nitrosomeproteomic id - gsnor1-3",90b,25699590,XCorr,3.3500000,,,,,0.052080001682043,-6.9900000
VQIVDTTCPWVTK,sno,C,213,true,"hot5-4 / wildtype, FAT-switch S-nitrosoproteome",169,37277371,,,,0.0015374,0.8883520,NO,,
VWNTVEKHK,ac,K,225,true,"Quantitative Acetylproteomics",101,29440448,,,,,,,,
VGIANQTTMLK,mox,M,314,true,"cat2 Methionine oxidation - 3h stress",62b,25693801,"MASCOT Score",47.0000000,,0.3624212,,NO,,
GIPSYWIDSEKR,ac,K,403,true,"Quantitative Acetylproteomics",101,29440448,,,,,,,,
GPITIGVTSGASTPDKVVEDALVK,ph,T,442,true,"Tissue atlas Arabidopsis - ProteomicsDB",114,32188942,"MaxQuant score",156.6700000,0.7839750,,,,0,
