Peptide,PTM,ModifiedAA,ModifiedPosition,PeptideUniqueToGene,ExperimentDesc,ExpID,PubmedID,ScoreType,IdentScore,LocProb,Log2FChange,PQ-val,QuantSig,PEP,MassErrorPPM
SATAAASSSIAVATNSLR,nt,S,2,true,"Tic56 chloroplast import - tic56-1",89c,25588737,XCorr,3.6076155,,,,,,
SATAAASSSIAVATNSLR,nta,S,2,true,"Tic56 chloroplast import - tic56-1",89c,25588737,XCorr,3.6076155,,,,,,
SPLPSAISVAFPSR,ph,S,27,true,"Tissue atlas Arabidopsis - ProteomicsDB",114,32188942,"MaxQuant score",134.2100000,0.9989590,,,,1.1482000479769E-22,
STGDGSKPTILVAEKLG,nt,S,55,true,"Arabidopsis translation initiation landscape - NT",167b,35069635,,,,,,,,
STGDGSKPTILVAE,nt,S,55,true,"Arg/N-end rule seed, prt6 vs. Wt",99,29168982,"MASCOT Score",36.8500000,,-0.0190520,0.8672663,NO,1.2089999756881E-7,-0.9325412
STGDGSKPTILVAE,nt,S,55,true,"HUNTER N-terminome: legumain, GluC and trypsin",119,31951383,"MaxQuant score",178.1000000,,,,,,
LLEDVANVDCSYNMTPEELNIK,sno,C,86,true,"Site-specific nitrosomeproteomic id - gsnor1-3",90a,25699590,XCorr,3.7600000,,,,,5.6750000112515E-6,-7.0000000
LLEDVANVDCSYNMTPEELNIK,sno,C,86,true,"Site-specific nitrosomeproteomic id - gsnor1-3",90b,25699590,XCorr,3.2700000,,,,,0.0084929997101426,-5.5500000
LLEDVANVDCSYNMTPEELNIK,so,C,86,true,"S-sulfenylation site detection using YAP1C",110,32714340,,,,,,,,
ISLCDALIVR,acy,C,102,false,"Arabidopsis S-acylation atlas - Meristem",163a,35681017,,,,,,,,
ISLCDALIVR,sno,C,102,false,"Site-specific nitrosomeproteomic id - gsnor1-3",90a,25699590,XCorr,3.5161004,,,,,0.0002954000083264,-6.4718257
ISLCDALIVR,so,C,102,false,"S-sulfenylation site detection using YAP1C",110,32714340,,,,,,,,
LVVNAPTANTIAAAE,nt,L,149,true,"Arg/N-end rule seed, prt6 vs. Wt",99,29168982,"MASCOT Score",68.6400000,,-0.7808854,0.2051390,NO,1.7910000678967E-5,-2.2589255
VVNAPTANTIAAAE,nt,V,150,true,"Arg/N-end rule seed, prt6 vs. Wt",99,29168982,"MASCOT Score",69.0900000,,-0.1835512,0.4033636,NO,2.7809999664896E-5,-2.3670340
NAPTANTIAAAE,nt,N,152,true,"Arg/N-end rule seed, prt6 vs. Wt",99,29168982,"MASCOT Score",46.7600000,,-0.8818449,0.0796050,NO,0.0020099999383092,-1.1086223
APTANTIAAAE,nt,A,153,true,"Arg/N-end rule seed, prt6 vs. Wt",99,29168982,"MASCOT Score",59.2800000,,-0.3105711,0.0895085,NO,0.00050329999066889,0.5058308
ANTIAAAE,nt,A,156,true,"Arg/N-end rule seed, prt6 vs. Wt",99,29168982,"MASCOT Score",41.9500000,,-0.3036058,0.1095563,NO,0.026900000870228,-0.1617081
TIAAAEHGIALMAAMAR,nt,T,158,true,"Arabidopsis translation initiation landscape - NT",167b,35069635,,,,,,,,
VIAHDPYAPADR,ph,Y,232,true,"Tissue atlas Arabidopsis - ProteomicsDB",114,32188942,"MaxQuant score",67.8870000,1.0000000,,,,0.0025974400341511,
ILNDETFAKMK,ac,K,279,true,"Quantitative Acetylproteomics",101,29440448,,,,,,,,
GGVIDEDALVR,nt,G,292,false,"Arg/N-end rule pathway Roots",80,25728785,"MASCOT Score",29.2400000,,,,,0.0086730001494288,
LAVQLVAGGSGVK,ph,S,407,true,"Tissue atlas Arabidopsis - ProteomicsDB",114,32188942,"MaxQuant score",119.7700000,1.0000000,,,,6.4957799622789E-5,
LAVQLVAGGSGVKNAK,ac,K,410,true,"Quantitative Acetylproteomics",101,29440448,,,,,,,,
ADFTAKQR,nt,A,452,true,"Metacaspase9 substrates - in vitro rMC9",51c,23964026,"MASCOT Score",46.0000000,,1.4371517,,NO,,-0.1845711
FASSLSESGEVKVEGK,ph,S,499,true,"Tissue atlas Arabidopsis - ProteomicsDB",114,32188942,"MaxQuant score",108.7100000,0.8215820,,,,6.8643899453491E-8,
