Peptide,PTM,ModifiedAA,ModifiedPosition,PeptideUniqueToGene,ExperimentDesc,ExpID,PubmedID,ScoreType,IdentScore,LocProb,Log2FChange,PQ-val,QuantSig,PEP,MassErrorPPM
ATTTTEATKTSSTNGEDQKQSQNLR,nt,A,2,true,"Stromal N-terminome",96,26371235,"MASCOT Score",91.4400000,,,,,,
ATTTTEATKTSSTNGEDQKQSQNLR,nt,A,2,true,"FtsH12 N-terminome: WT / FtsH12 knockdown miRNA",118,33216923,"MaxQuant score",106.0100000,,3.3730593,0.0068529,YES,0.0032013999298215,
ATTTTEATKTSSTNGEDQKQSQN,nt,A,2,true,"Arg/N-end rule seed, prt6 vs. Wt",99,29168982,"MASCOT Score",54.3300000,,,,,6.5849999373313E-6,-0.7727671
ATTTTEATKTSSTNGEDQKQSQ,nt,A,2,true,"Arg/N-end rule seed, prt6 vs. Wt",99,29168982,"MASCOT Score",35.8800000,,,,,0.0011340000201017,0.1363678
ATTTTEATKTSS,nt,A,2,true,"Arg/N-end rule seed, prt6 vs. Wt",99,29168982,"MASCOT Score",35.5800000,,,,,0.12819999456406,-1.7066018
ATTTTEATKT,nt,A,2,true,"N-term acetylation drought responses",5,26184543,,,,,,,,
ATTTTEATKT,nt,A,2,true,"Arg/N-end rule seed, prt6 vs. Wt",99,29168982,"MASCOT Score",41.8200000,,,,,0.068790003657341,-1.0145115
ATTTTEATKTSSTNGEDQKQSQNLR,nta,A,2,true,"Arg/N-end rule pathway Roots",80,25728785,"MASCOT Score",79.2500000,,,,,1.43899997056E-5,
ATTTTEATKTSSTNGEDQKQSQNLR,nta,A,2,true,"Stromal N-terminome",96,26371235,"MASCOT Score",91.4400000,,,,,,
ATTTTEATKTSSTNGEDQKQSQNLR,nta,A,2,true,"HUNTER N-terminome: legumain, GluC and trypsin",119,31951383,"MaxQuant score",128.1200000,,,,,,
ATTTTEATKTSSTNGEDQKQSQNLR,nta,A,2,true,"Arabidopsis translation initiation landscape - NTA",167a,35069635,,,,,,,,
ATTTTEATKTSSTNGEDQKQSQN,nta,A,2,true,"Arg/N-end rule seed, prt6 vs. Wt",99,29168982,"MASCOT Score",54.3300000,,-0.6000962,0.0686177,NO,6.5849999373313E-6,-0.7727671
ATTTTEATKTSSTNGEDQKQSQ,nta,A,2,true,"Arg/N-end rule seed, prt6 vs. Wt",99,29168982,"MASCOT Score",35.8800000,,0.0710016,0.5760687,NO,0.0011340000201017,0.1363678
ATTTTEATKTSSTNGEDQK,nta,A,2,true,"Arg/N-end rule pathway Roots",80,25728785,"MASCOT Score",77.7800000,,,,,8.9619999243951E-7,
ATTTTEATKTSS,nta,A,2,true,"Arg/N-end rule seed, prt6 vs. Wt",99,29168982,"MASCOT Score",35.5800000,,-0.3430073,0.4365577,NO,0.12819999456406,-1.7066018
ATTTTEATKT,nta,A,2,true,"N-term acetylation drought responses",5,26184543,,,,,,,,
ATTTTEATKT,nta,A,2,true,"Arg/N-end rule seed, prt6 vs. Wt",99,29168982,"MASCOT Score",41.8200000,,-0.0990094,0.6004738,NO,0.068790003657341,-1.0145115
ATTTTEATK,nta,A,2,true,"Characterization plant N-terminal acetylation",6,22223895,"MASCOT Score",57.9700000,,,,,,
ATTTTEATKTSSTNGEDQK,ac,K,10,true,"Quantitative Acetylproteomics",101,29440448,,,,,,,,
TSSTNGEDQKQSQNLR,ph,S,13,true,"Tissue atlas Arabidopsis - ProteomicsDB",114,32188942,"MaxQuant score",162.2600000,0.9894720,,,,9.9324601278081E-14,
TSSTNGEDQKQSQNLR,ph,S,22,true,"Tissue atlas Arabidopsis - ProteomicsDB",114,32188942,"MaxQuant score",172.0000000,1.0000000,,,,6.6041201839787E-20,
ATALALPE,nt,A,108,true,"Arg/N-end rule seed, prt6 vs. Wt",99,29168982,"MASCOT Score",46.1100000,,-0.1778324,0.5939566,NO,0.021560000255704,-0.4854098
ENYELGLPIIEKAGVAHK,cr,K,138,true,"Open search Plant PTM Viewer 2.0 - Crotonylation",164c,TBA,,,,,,,,
AGVAHKIDFR,ac,K,144,true,"Quantitative Acetylproteomics",101,29440448,,,,,,,,
NHGTYDFIFVDADKDNYINYHK,ac,K,178,true,"Histone deacetylases substrates - hda14 vs WT",98e,29061669,"MaxQuant Score",67.4000000,1.0000000,0.1300000,0.8689604,NO,2.3999999143598E-7,
DFVLELNKALAADPR,ub,K,233,true,"upl3 mutant / wildtype",168,35926874,"MaxQuant score",119.4500000,1.0000000,1.0969365,0.0703590,NO,3.5797299346996E-8,1.6177000
