Peptide,PTM,ModifiedAA,ModifiedPosition,PeptideUniqueToGene,ExperimentDesc,ExpID,PubmedID,ScoreType,IdentScore,LocProb,Log2FChange,PQ-val,QuantSig,PEP,MassErrorPPM
GFCVGILPDGVDR,nt,G,44,true,"Mitochondrial intermediate peptidases - icp55 / WT",131a,25732537,,82.9600000,,6.6438562,,,,
FCVGILPDGVDR,nt,F,45,true,"Mitochondrial intermediate peptidases - icp55 / WT",131a,25732537,,60.1700000,,4.2124996,,,,
FCVGILPDGVDR,nt,F,45,true,"Mitochondrial intermediate peptidases - oct1-2 / WT",131c,25732537,,44.1500000,,0.0460875,,,,
CVGILPDGVDR,nt,C,46,true,"Arg/N-end rule seed, prt6 vs. Wt",99,29168982,"MASCOT Score",41.5800000,,0.0604982,0.7304020,NO,0.020460000261664,-0.7683007
CVGILPDGVDR,nt,C,46,true,"Mitochondrial intermediate peptidases - oct1-1 / WT",131b,25732537,,61.9300000,,-0.2979073,,,,
KVLAGGGEEAVKR,ac,K,92,true,"Quantitative Acetylproteomics",101,29440448,,,,,,,,
VLAGGGEEAVKR,ac,K,92,true,"Quantitative Acetylproteomics",101,29440448,,,,,,,,
LPCIYLVDSGGAYLPK,ox,C,185,true,"Redox kickstart of mitochondria",112,31871212,,,,-1.1190482,0.0001046,YES,,
GAHFIELCSQR,ox,C,415,true,"Redox kickstart of mitochondria",112,31871212,,,,-1.2221468,0.0068300,YES,,
ITIITGASFGAGNYAMCGR,ox,C,477,true,"Redox kickstart of mitochondria",112,31871212,,,,-1.0608754,0.0012866,YES,,
LWDDGVIDPCDTR,ox,C,559,true,"Redox kickstart of mitochondria",112,31871212,,,,-0.9614413,0.0038425,YES,,
VLGLCLSAALNRPLEDTR,ox,C,568,true,"Redox kickstart of mitochondria",112,31871212,,,,-1.1890041,0.0067734,YES,,
