Peptide,PTM,ModifiedAA,ModifiedPosition,PeptideUniqueToGene,ExperimentDesc,ExpID,PubmedID,ScoreType,IdentScore,LocProb,Log2FChange,PQ-val,QuantSig,PEP,MassErrorPPM
DFGSMNMDELLK,ph,S,55,false,"Phytohormone-responsive phosphoproteins",34,20374526,"MASCOT Score",54.0000000,,,,,,
DFGSMNMDELLK,ph,S,55,false,"srk2dei ABA signaling phopshoproteomics",83,23572148,"MASCOT Score",64.0000000,,,,,,0.0002000
DFGSMNMDELLK,ph,S,55,false,"SnRK2 protein kinase substrates",85,23776212,XCorr,2.6659536,1.0000000,,,,0.026427699252963,
DFGSMNMDELLK,ph,S,55,false,"TOR Kinase and ABA Receptor",100,29290610,XCorr,4.2398891,1.0000000,,,,1.1240000503676E-6,
DFGSMNMDELLK,ph,S,55,false,"Phospho cell culture sucrose/TOR",109,30833711,,,1.0000000,,,,,
DFGSMNMDELLK,ph,S,55,false,"Tissue atlas Arabidopsis - ProteomicsDB",114,32188942,"MaxQuant score",204.3100000,1.0000000,,,,2.875410115586E-31,
QGSLTLPR,ph,S,126,false,"ABA-induced protein phosphorylation",35,20733066,,,,,,,,
QGSLTLPR,ph,S,126,false,"Phosphoproteome ethylene-regulated time response",46,24043427,"MASCOT Score",47.2500000,,,,,,-22.9304000
QGSLTLPR,ph,S,126,false,"srk2dei ABA signaling phopshoproteomics",83,23572148,"MASCOT Score",49.0000000,,,,,,-0.0005000
QGSLTLPR,ph,S,126,false,"LAXIC - ABA stress",84a,23660473,XCorr,2.1200000,0.9950000,,,,0.004308819770813,
QGSLTLPR,ph,S,126,false,"LAXIC - mannitol vs control",84b,23660473,XCorr,2.3400000,0.9350000,,,,0.001663270057179,
QGSLTLPR,ph,S,126,false,"atm and atr DNA damage response",88,25561503,"MASCOT Score",47.0000000,0.9960000,,,,,-0.7700000
QGSLTLPR,ph,S,126,false,"TOR Kinase and ABA Receptor",100,29290610,XCorr,2.7452154,0.9101000,,,,0.0026700000744313,
QGSLTLPR,ph,S,126,false,"Col-0 callus - FC Col-0 vs. Col-0 Xray",111a,31410901,,29.4800000,,-0.7236115,0.0000000,NO,,0.1178629
QGSLTLPR,ph,S,126,false,"Col-0 X-ray callus - FC Col-0 vs. Col-0 Xray",111b,31410901,,29.4800000,,-0.7236115,0.0000000,NO,,0.1178629
QGSLTLPR,ph,S,126,false,"atm callus - FC atm vs. atm Xray",111c,31410901,,29.4800000,,-0.0335836,0.0000000,NO,,0.1178629
QGSLTLPR,ph,S,126,false,"atm-3 X-ray callus - FC atm vs. atm Xray",111d,31410901,,29.4800000,,-0.0335836,0.0000000,NO,,0.1178629
QGSLTLPR,ph,S,126,false,"Tissue atlas Arabidopsis - ProteomicsDB",114,32188942,"MaxQuant score",183.2200000,1.0000000,,,,9.4484503279091E-6,
QGSLTLPR,ph,T,128,false,"Tyrosine phosphorylation in Arabidopsis",59,18463617,"MASCOT Score",22.0000000,,,,,,-1.6834006
QGSLTLPR,ph,T,128,false,"srk2dei ABA signaling phopshoproteomics",83,23572148,"MASCOT Score",26.0000000,,,,,,0.0005000
QGSLTLPR,ph,T,128,false,"SnRK2 protein kinase substrates",85,23776212,XCorr,2.2104070,0.9990000,,,,0.0014614500105381,
QQTLGEMTLEEFLVR,ph,T,169,true,"TOR Kinase and ABA Receptor",100,29290610,XCorr,4.6057696,1.0000000,,,,1.703000052089E-8,
QTTIAFSNTVDVVNR,og,T,278,true,"O-GlcNac Inflorescence Tissue",81,28154133,"MASCOT Score",28.6000000,,,,,,2.1000000
TGVTVAAVSPGSQMSPDLTPKSALDASLSPVPYMFGRVR,ph,T,327,true,"PAMP-triggered phosphorylation",48,24601666,"MASCOT Score",20.4800000,,,,,,
TGVTVAAVSPGSQMSPDLTPK,ph,S,332,true,"atm and atr DNA damage response",88,25561503,"MASCOT Score",27.0000000,1.0000000,,,,,-0.2300000
TGVTVAAVSPGSQMSPDLTPK,ph,S,332,true,"Tissue atlas Arabidopsis - ProteomicsDB",114,32188942,"MaxQuant score",301.4100000,0.9999990,,,,0,
TGVTVAAVSPGSQMSPDLTPK,ph,S,335,true,"Tissue atlas Arabidopsis - ProteomicsDB",114,32188942,"MaxQuant score",139.5500000,0.7684440,,,,3.1157998894087E-22,
TGVTVAAVSPGSQMSPDLTPK,ph,S,338,true,"Tissue atlas Arabidopsis - ProteomicsDB",114,32188942,"MaxQuant score",197.1900000,0.9149460,,,,0,
SALDASLSPVPYMFGR,ph,S,352,true,"TOR Kinase and ABA Receptor",100,29290610,XCorr,3.9257364,0.8922000,,,,0.0011269999668002,
SALDASLSPVPYMFGR,ph,S,352,true,"Lateral root-induction - NAA vs control",106,23328941,"MASCOT Score",44.0000000,,,,,,
SALDASLSPVPYMFGR,ph,S,352,true,"Tissue atlas Arabidopsis - ProteomicsDB",114,32188942,"MaxQuant score",280.5000000,0.9999740,,,,0,
RTLTGPW,ph,T,451,false,"TOR Kinase and ABA Receptor",100,29290610,XCorr,2.3279934,1.0000000,,,,0.011079999618232,
