Peptide,PTM,ModifiedAA,ModifiedPosition,PeptideUniqueToGene,ExperimentDesc,ExpID,PubmedID,ScoreType,IdentScore,LocProb,Log2FChange,PQ-val,QuantSig,PEP,MassErrorPPM
LNNNSLSGEIPR,ng,N,149,true,"N-Glycopeptide Profiling in Arabidopsis Infloresce",132,27067053,"MOWSE score",34.5000000,,,,,2.4999999368447E-5,
LNNNSLSGEIPR,ng,N,149,true,"ER-associatied N-glycan degradation chilling stres",133,27558752,,,,,,,,
LNNNSLSGEIPR,ng,N,149,true,"N-linked Glycan Micro-heterogeneity Arabidopsis",134,29237727,,,,,,,,
LNNNSLSGEIPR,ng,N,149,true,"UDP-GlcNAc transporter glycopeptide analysis",135,30224661,,,,,,,2.4897438694456E-15,0.5000000
ELQVASDNFSNK,ng,N,288,true,"Conserved N-glycosylation",74,22633491,"MaxQuant Score",108.8400000,0.9990000,,,,5.3539999100849E-9,-1.1530000
ELQVASDNFSNKNILGR,ph,S,290,true,"Tissue atlas Arabidopsis - ProteomicsDB",114,32188942,"MaxQuant score",59.5370000,0.9819870,,,,0.00022083100338932,
LADGTLVAVKR,ac,K,317,false,"Quantitative Acetylproteomics",101,29440448,,,,,,,,
LMDYKDTHVTTAVR,ph,Y,443,false,"Tissue atlas Arabidopsis - ProteomicsDB",114,32188942,"MaxQuant score",109.0400000,0.9434600,,,,0.00081744900671765,
LMDYKDTHVTTAVR,ph,T,446,false,"atm and atr DNA damage response",88,25561503,"MASCOT Score",23.0000000,1.0000000,,,,,-0.6100000
LMDYKDTHVTTAVR,ph,T,446,false,"Tissue atlas Arabidopsis - ProteomicsDB",114,32188942,"MaxQuant score",147.1600000,0.9997370,,,,2.0876700546069E-7,
LMDYKDTHVTTAVR,ph,T,449,false,"Plasmamembrane phosphorylation",20,15308754,,,,,,,,
LMDYKDTHVTTAVR,ph,T,449,false,"atm and atr DNA damage response",88,25561503,"MASCOT Score",23.0000000,1.0000000,,,,,-0.6100000
LMDYKDTHVTTAVR,ph,T,449,false,"Tissue atlas Arabidopsis - ProteomicsDB",114,32188942,"MaxQuant score",206.2700000,0.9999990,,,,1.7489900519074E-15,
DTHVTTAVR,ph,T,449,false,"Plasmembrane Ph Immune Responses",25,17651370,,,,,,,,
DTHVTTAVR,ph,T,449,false,"atm and atr DNA damage response",88,25561503,"MASCOT Score",50.0000000,1.0000000,,,,,-0.1700000
LMDYKDTHVTTAVR,ph,T,450,false,"Plasmamembrane phosphorylation",20,15308754,,,,,,,,
LMDYKDTHVTTAVR,ph,T,450,false,"Large-scale phosphorylation discovery",44,23111157,XCorr,4.5300000,,,,,,
LMDYKDTHVTTAVR,ph,T,450,false,"atm and atr DNA damage response",88,25561503,"MASCOT Score",23.0000000,1.0000000,,,,,-0.6100000
LMDYKDTHVTTAVR,ph,T,450,false,"Tissue atlas Arabidopsis - ProteomicsDB",114,32188942,"MaxQuant score",95.6180000,1.0000000,,,,8.3627201092895E-5,
DTHVTTAVR,ph,T,450,false,"Plasmembrane Ph Immune Responses",25,17651370,,,,,,,,
DTHVTTAVR,ph,T,450,false,"atm and atr DNA damage response",88,25561503,"MASCOT Score",50.0000000,1.0000000,,,,,-0.1700000
GTIGHIAPEYLSTGK,ph,T,455,false,"atm and atr DNA damage response",88,25561503,"MASCOT Score",35.0000000,1.0000000,,,,,-3.7500000
GTIGHIAPEYLSTGK,ph,T,455,false,"Tissue atlas Arabidopsis - ProteomicsDB",114,32188942,"MaxQuant score",65.4230000,0.9999880,,,,0.00044692700612359,
GTIGHIAPEYLSTGK,ph,S,465,false,"atm and atr DNA damage response",88,25561503,"MASCOT Score",42.0000000,0.9440000,,,,,1.4200000
GTIGHIAPEYLSTGK,ph,S,465,false,"Tissue atlas Arabidopsis - ProteomicsDB",114,32188942,"MaxQuant score",132.5100000,0.9186330,,,,8.7204202192659E-13,
LELITGQR,nt,L,483,false,"HUNTER N-terminome: legumain, GluC and trypsin",119,31951383,"MaxQuant score",78.6160000,,,,,,
