Peptide,PTM,ModifiedAA,ModifiedPosition,PeptideUniqueToGene,ExperimentDesc,ExpID,PubmedID,ScoreType,IdentScore,LocProb,Log2FChange,PQ-val,QuantSig,PEP,MassErrorPPM
SVSGVSSDAGNSVSSVER,ph,S,129,true,"Tissue atlas Arabidopsis - ProteomicsDB",114,32188942,"MaxQuant score",249.7200000,0.9998960,,,,0,
SVSGVSSDAGNSVSSVER,ph,S,132,true,"Tissue atlas Arabidopsis - ProteomicsDB",114,32188942,"MaxQuant score",46.9640000,0.7970020,,,,0.0043107802048326,
TVSFGIASSSR,ph,S,147,true,"srk2dei ABA signaling phopshoproteomics",83,23572148,"MASCOT Score",35.0000000,,,,,,0.0004000
TVSFGIASSSR,ph,S,147,true,"atm and atr DNA damage response",88,25561503,"MASCOT Score",46.0000000,1.0000000,,,,,-0.0200000
TVSFGIASSSR,ph,S,147,true,"TOR Kinase and ABA Receptor",100,29290610,XCorr,3.0755990,0.8889000,,,,0.00028320000274107,
TVSFGIASSSR,ph,S,147,true,"Tissue atlas Arabidopsis - ProteomicsDB",114,32188942,"MaxQuant score",144.5700000,0.9999510,,,,4.2256701249244E-8,
FCPKISSVSMSK,ph,S,967,true,"Phosphorylation in N starvation",63,22060019,"MASCOT Score",24.0000000,,,,,,6.3261200
RVFSSPNLLQD,ph,S,983,true,"atm and atr DNA damage response",88,25561503,"MASCOT Score",32.0000000,0.9990000,,,,,-1.0000000
RVFSSPNLLQD,ph,S,983,true,"Tissue atlas Arabidopsis - ProteomicsDB",114,32188942,"MaxQuant score",119.3900000,0.8970930,,,,1.9113800590276E-5,
VFSSPNLLQD,ph,S,983,true,"atm and atr DNA damage response",88,25561503,"MASCOT Score",33.0000000,0.9620000,,,,,1.0100000
RVFSSPNLLQD,ph,S,984,true,"Tissue atlas Arabidopsis - ProteomicsDB",114,32188942,"MaxQuant score",141.5800000,0.9185460,,,,2.2531699528372E-7,
