Peptide,PTM,ModifiedAA,ModifiedPosition,PeptideUniqueToGene,ExperimentDesc,ExpID,PubmedID,ScoreType,IdentScore,LocProb,Log2FChange,PQ-val,QuantSig,PEP,MassErrorPPM
ISGAAIRTYLLER,ph,T,241,false,"Brassinosteroid-Regulated Phosphorylation Dynamics",94,26187819,"MaxQuant Score",87.5660000,1.0000000,,,,0.013000000268221,-3.1960000
LRTFVTHQNFISAR,ph,T,753,true,"Tissue atlas Arabidopsis - ProteomicsDB",114,32188942,"MaxQuant score",150.1300000,0.9999430,,,,1.2019999928725E-7,
TNCNNTLQK,sno,C,1015,true,"hot5-4 / wildtype, FAT-switch S-nitrosoproteome",169,37277371,,,,0.0511574,0.4389882,NO,,
TLITSPER,ph,S,1061,true,"TOR Kinase and ABA Receptor",100,29290610,XCorr,2.3124895,0.9997000,,,,0.0015119999879971,
TLITSPER,ph,S,1061,true,"Tissue atlas Arabidopsis - ProteomicsDB",114,32188942,"MaxQuant score",176.6000000,0.9999910,,,,9.2174203018658E-5,
SNSFLNASAQR,ph,S,1210,true,"Tissue atlas Arabidopsis - ProteomicsDB",114,32188942,"MaxQuant score",111.5300000,1.0000000,,,,3.2752199331298E-5,
AAYGVKSPFK,ph,S,1223,true,"atm and atr DNA damage response",88,25561503,"MASCOT Score",26.0000000,1.0000000,,,,,-2.1500000
AAYGVKSPFK,ph,S,1223,true,"Tissue atlas Arabidopsis - ProteomicsDB",114,32188942,"MaxQuant score",150.1400000,1.0000000,,,,1.2934799542563E-6,
SPGGVPQQSPSSQWESILK,ph,S,1292,true,"Tissue atlas Arabidopsis - ProteomicsDB",114,32188942,"MaxQuant score",123.5500000,1.0000000,,,,2.4109000521877E-14,
FVSEYTCAQSLVK,ph,S,1507,true,"Tissue atlas Arabidopsis - ProteomicsDB",114,32188942,"MaxQuant score",233.3100000,1.0000000,,,,0,
