Peptide,PTM,ModifiedAA,ModifiedPosition,PeptideUniqueToGene,ExperimentDesc,ExpID,PubmedID,ScoreType,IdentScore,LocProb,Log2FChange,PQ-val,QuantSig,PEP,MassErrorPPM
MDQFKGEPRLPKFAVPKRYD,nta,M,1,true,"Arabidopsis translation initiation landscape - NTA",167a,35069635,,,,,,,,
MDQFKGEPRL,nta,M,1,true,"N-term acetylation drought responses",5,26184543,,,,,,,,
MDQFKGEPR,nta,M,1,true,"Arg/N-end rule seed, prt6 vs. Wt",99,29168982,"MASCOT Score",23.2800000,,0.2846007,0.2198429,NO,0.074380002915859,0.3969934
MDQFKGEPR,nta,M,1,true,"FtsH12 N-terminome: WT / FtsH12 knockdown miRNA",118,33216923,"MaxQuant score",299.2900000,,,,,0,
STYEHNGEKKNMAVTQFEPADAR,nt,S,121,true,"Arabidopsis translation initiation landscape - NT",167b,35069635,,,,,,,,
ETALLYDEQHSAASNKQR,ac,K,298,true,"Quantitative Acetylproteomics",101,29440448,,,,,,,,
ELLGCSIADGSDK,acy,C,521,true,"Arabidopsis S-acylation atlas - Meristem",163a,35681017,,,,,,,,
ELLGCSIADGSDK,acy,C,521,true,"Arabidopsis S-acylation atlas - Leaf",163c,35681017,,,,,,,,
ELLGCSIADGSDKINGTCSWIK,ox,C,521,true,"SPEAR - 50 mM H2O2 / mock",138b,34619326,,,,-2.0883241,0.0303377,YES,,
ELLGCSIADGSDK,sno,C,521,true,"Site-specific nitrosomeproteomic id - gsnor1-3",90b,25699590,XCorr,2.2000000,,,,,0.24899999797344,-6.3700000
ELLGCSIADGSDK,sno,C,521,true,"hot5-4 / wildtype, FAT-switch S-nitrosoproteome",169,37277371,,,,0.2014597,0.0117081,NO,,
ELLGCSIADGSDK,ph,S,522,true,"Tissue atlas Arabidopsis - ProteomicsDB",114,32188942,"MaxQuant score",91.2070000,0.9984250,,,,0.00037558301119134,
NATESQSLTSIDR,ph,S,567,true,"Tissue atlas Arabidopsis - ProteomicsDB",114,32188942,"MaxQuant score",130.4700000,0.9568520,,,,4.204310073419E-7,
ETDLSQEKTR,ub,K,741,true,"Arabidopsis ubiquitination COFRADIC",40,26744219,"MaxQuant Score",53.5670000,1.0000000,,,,0.016000000759959,-0.1470000
TLKQSIER,ub,K,847,true,"Arabidopsis ubiquitination COFRADIC",40,26744219,"MaxQuant Score",73.2330000,1.0000000,,,,0.026000000536442,1.0450000
