Peptide,PTM,ModifiedAA,ModifiedPosition,PeptideUniqueToGene,ExperimentDesc,ExpID,PubmedID,ScoreType,IdentScore,LocProb,Log2FChange,PQ-val,QuantSig,PEP,MassErrorPPM
MDTKIGSIDD,nta,M,1,true,"Arg/N-end rule seed, prt6 vs. Wt",99,29168982,"MASCOT Score",31.8600000,,0.8369736,0.0007858,NO,0.00071679998654872,3.8063065
MDTKIGSIDD,nta,M,1,true,"Arabidopsis translation initiation landscape - NTA",167a,35069635,,,,,,,,
LIGCCNELNAGYAADGYAR,ox,C,89,false,"OxiTRAQ SA and flg22 responses - SA vs mock",91a,25720653,"MASCOT Score",107.2700000,,0.6322682,0.0110000,YES,,
LIGCCNELNAGYAADGYAR,ox,C,89,false,"OxiTRAQ SA and flg22 responses - flg22 vs mock",91b,25720653,"MASCOT Score",107.2700000,,-0.8624965,0.0000000,YES,,
LIGCCNELNAGYAADGYAR,ox,C,90,false,"OxiTRAQ SA and flg22 responses - SA vs mock",91a,25720653,"MASCOT Score",107.2700000,,0.6322682,0.0110000,YES,,
LIGCCNELNAGYAADGYAR,ox,C,90,false,"OxiTRAQ SA and flg22 responses - flg22 vs mock",91b,25720653,"MASCOT Score",107.2700000,,-0.8624965,0.0000000,YES,,
ILHHTIGLPDFSQELR,ph,S,164,false,"Tissue atlas Arabidopsis - ProteomicsDB",114,32188942,"MaxQuant score",81.0030000,1.0000000,,,,7.9824400017969E-5,
DPVPFSLAPR,ph,S,228,true,"Tissue atlas Arabidopsis - ProteomicsDB",114,32188942,"MaxQuant score",91.3130000,1.0000000,,,,0.0011085199657828,
AVKPVMVGGPKLR,ac,K,263,false,"Quantitative Acetylproteomics",101,29440448,,,,,,,,
ACDAFVELADASGYALAMMPSAK,sno,C,270,true,"hot5-4 / wildtype, FAT-switch S-nitrosoproteome",169,37277371,,,,2.1109635,0.0000087,YES,,
MLSSETAVIAETGDSWFNCQK,so,C,439,false,"S-sulfenylation site detection using YAP1C",110,32714340,,,,,,,,
CWTAK,ox,C,547,false,"OxiTRAQ Arabidopsis - 5 mM H2O2 versus control",47,24376095,,,,0.6452862,0.0292140,NO,,
CWTAK,ox,C,547,false,"OxiTRAQ SA and flg22 responses - SA vs mock",91a,25720653,"MASCOT Score",29.4000000,,0.7570232,0.0000000,YES,,
CWTAK,ox,C,547,false,"OxiTRAQ SA and flg22 responses - flg22 vs mock",91b,25720653,"MASCOT Score",29.4000000,,-0.5145732,0.0210000,NO,,
VSAANSRPPNPQ,ph,S,597,false,"Tissue atlas Arabidopsis - ProteomicsDB",114,32188942,"MaxQuant score",122.1500000,0.9999990,,,,6.3359198975377E-5,
