Peptide,PTM,ModifiedAA,ModifiedPosition,PeptideUniqueToGene,ExperimentDesc,ExpID,PubmedID,ScoreType,IdentScore,LocProb,Log2FChange,PQ-val,QuantSig,PEP,MassErrorPPM
SLSFNSWEVPKETKTDSDFEVLETK,ph,S,43,true,"MAPK Arabidopsis substrates",45,23172892,"MaxQuant Score",93.9660000,,,,,,
SLSFNSWEVPKETK,ph,S,43,true,"MAPK Arabidopsis substrates",45,23172892,"MaxQuant Score",163.2700000,,,,,,
SLSFNSWEVPK,ph,S,43,true,"srk2dei ABA signaling phopshoproteomics",83,23572148,"MASCOT Score",35.0000000,,,,,,0.0002000
SLSFNSWEVPK,ph,S,45,true,"PAMP-triggered phosphorylation",48,24601666,"MASCOT Score",34.3500000,,,,,,
SLSFNSWEVPK,ph,S,45,true,"Chloroplast kinase substrates",60,19376835,"MASCOT Score",39.8000000,,,,,,-0.2148830
SLSFNSWEVPK,ph,S,45,true,"srk2dei ABA signaling phopshoproteomics",83,23572148,"MASCOT Score",63.0000000,,,,,,0.0007000
SLSFNSWEVPK,ph,S,45,true,"LAXIC - ABA stress",84a,23660473,XCorr,3.3500000,0.9950000,,,,0.071111403405666,
SLSFNSWEVPK,ph,S,45,true,"LAXIC - mannitol vs control",84b,23660473,XCorr,3.2900000,0.9970000,,,,0.0011491300538182,
SLSFNSWEVPK,ph,S,45,true,"SnRK2 protein kinase substrates",85,23776212,XCorr,3.1346269,0.9980000,,,,8.6140700128468E-10,
SLSFNSWEVPK,ph,S,45,true,"atm and atr DNA damage response",88,25561503,"MASCOT Score",51.0000000,0.9960000,,,,,0.3100000
SLSFNSWEVPK,ph,S,45,true,"TOR Kinase and ABA Receptor",100,29290610,XCorr,4.2160764,0.9884000,,,,0.00014659999578726,
SLSFNSWEVPK,ph,S,45,true,"Lateral root-induction - NAA vs control",106,23328941,"MASCOT Score",33.0000000,,,,,,
SLSFNSWEVPK,ph,S,45,true,"Col-0 callus - FC Col-0 vs. Col-0 Xray",111a,31410901,,23.4000000,,-0.1910165,0.0000000,NO,,4.1976596
SLSFNSWEVPK,ph,S,45,true,"Col-0 X-ray callus - FC Col-0 vs. Col-0 Xray",111b,31410901,,23.4000000,,-0.1910165,0.0000000,NO,,4.1976596
SLSFNSWEVPK,ph,S,45,true,"atm callus - FC atm vs. atm Xray",111c,31410901,,23.4000000,,-0.4925649,0.0000000,NO,,4.1976596
SLSFNSWEVPK,ph,S,45,true,"atm-3 X-ray callus - FC atm vs. atm Xray",111d,31410901,,23.4000000,,-0.4925649,0.0000000,NO,,4.1976596
SLSFNSWEVPK,ph,S,45,true,"Tissue atlas Arabidopsis - ProteomicsDB",114,32188942,"MaxQuant score",244.7300000,1.0000000,,,,0,
SLSFNSWEVPK,ph,S,45,true,"Touch-induced phosphorylation: 40s touch vs untouc",136,30291188,"MASCOT score",65.9000000,,1.6364627,0.2177000,NO,,4.7846899
ETKTDSDFEVLETK,ph,S,59,true,"atm and atr DNA damage response",88,25561503,"MASCOT Score",45.0000000,1.0000000,,,,,0.5300000
TDSDFEVLETK,ph,S,59,true,"atm and atr DNA damage response",88,25561503,"MASCOT Score",27.0000000,0.9530000,,,,,0.8500000
TDSDFEVLETK,ph,S,59,true,"TOR Kinase and ABA Receptor",100,29290610,XCorr,4.2399564,1.0000000,,,,1.3410000065051E-5,
TDSDFEVLETK,ph,S,59,true,"Tissue atlas Arabidopsis - ProteomicsDB",114,32188942,"MaxQuant score",160.5600000,0.9999650,,,,1.1002999900089E-10,
KPTVTPPEPFVFFSPRPVTELDAAATTLQK,ph,S,99,true,"TOR Kinase and ABA Receptor",100,29290610,XCorr,3.2385335,0.9958000,,,,0.0006887000054121,
