Peptide,PTM,ModifiedAA,ModifiedPosition,PeptideUniqueToGene,ExperimentDesc,ExpID,PubmedID,ScoreType,IdentScore,LocProb,Log2FChange,PQ-val,QuantSig,PEP,MassErrorPPM
TAVPITQQAPPETSTNNSSSKPKR,nt,T,63,true,"Stromal N-terminome",96,26371235,"MASCOT Score",35.1500000,,,,,,
TAVPITQQAPPETSTNNSSSKPKR,nt,T,63,true,"FtsH12 N-terminome: WT / FtsH12 knockdown miRNA",118,33216923,"MaxQuant score",101.3200000,,2.8933351,0.0106483,YES,1.1900000096432E-8,
TAVPITQQAPPETSTNNSSSKPKR,nt,T,63,true,"HUNTER N-terminome: legumain, GluC and trypsin",119,31951383,"MaxQuant score",109.4100000,,,,,,
TAVPITQQAPPETSTN,nt,T,63,true,"HUNTER N-terminome: legumain, GluC and trypsin",119,31951383,"MaxQuant score",150.1400000,,,,,,
TAVPITQQAPPE,nt,T,63,true,"N-terminal ChaFRADIC",92,26010716,"MASCOT Score",56.6800000,,,,,0.00017899999511428,
TAVPITQQAPPE,nt,T,63,true,"Arg/N-end rule seed, prt6 vs. Wt",99,29168982,"MASCOT Score",61.0900000,,-0.1730130,0.0715924,NO,6.4269997892552E-6,-2.0357719
TAVPITQQAPPE,nt,T,63,true,"HUNTER N-terminome: legumain, GluC and trypsin",119,31951383,"MaxQuant score",101.6500000,,,,,,
TAVPITQQ,nt,T,63,true,"N-terminal ChaFRADIC",92,26010716,"MASCOT Score",34.8400000,,,,,0.01522000040859,
TAVPITQQAPPETSTNNSSSKPKR,nta,T,63,true,"Stromal N-terminome",96,26371235,"MASCOT Score",35.1500000,,,,,,
TAVPITQQAPPETSTNNSSSKPKR,nta,T,63,true,"FtsH12 N-terminome: WT / FtsH12 knockdown miRNA",118,33216923,"MaxQuant score",113.4200000,,,,,6.4799997798073E-28,
TAVPITQQAPPETSTNNSSSKPKR,nta,T,63,true,"HUNTER N-terminome: legumain, GluC and trypsin",119,31951383,"MaxQuant score",50.5310000,,,,,,
TAVPITQQAPPETSTNNSSSKPKR,nta,T,63,true,"Arabidopsis translation initiation landscape - NTA",167a,35069635,,,,,,,,
TAVPITQQAPPETSTN,nta,T,63,true,"HUNTER N-terminome: legumain, GluC and trypsin",119,31951383,"MaxQuant score",135.8100000,,,,,,
AVPITQQAPPETSTNNSSSKPKRVMVIGG,nt,A,64,true,"Arabidopsis translation initiation landscape - NT",167b,35069635,,,,,,,,
AVPITQQAPPETSTNNSSSKPKR,nt,A,64,true,"FtsH12 N-terminome: WT / FtsH12 knockdown miRNA",118,33216923,"MaxQuant score",74.0000000,,2.8502009,0.0115125,YES,5.1699998948607E-7,
AVPITQQAPPETSTNNSSSKPKR,nt,A,64,true,"HUNTER N-terminome: legumain, GluC and trypsin",119,31951383,"MaxQuant score",72.0860000,,,,,,
AVPITQQAPPETSTN,nt,A,64,true,"HUNTER N-terminome: legumain, GluC and trypsin",119,31951383,"MaxQuant score",93.7660000,,,,,,
AVPITQQAPPE,nt,A,64,true,"N-terminal ChaFRADIC",92,26010716,"MASCOT Score",46.0000000,,,,,0.00030240000342019,
AVPITQQAPPE,nt,A,64,true,"Arg/N-end rule seed, prt6 vs. Wt",99,29168982,"MASCOT Score",49.7800000,,0.0552460,0.8470861,NO,9.9739998404402E-5,-2.0437886
NYEVCIVDNLVR,sno,C,112,true,"Site-specific nitrosomeproteomic id - gsnor1-3",90a,25699590,XCorr,2.4400694,,,,,1.1230000382056E-5,-6.4370964
SAPYSMIDR,nt,S,185,true,"N-terminal ChaFRADIC",92,26010716,"MASCOT Score",35.6400000,,,,,0.0028810000512749,
FCVQAAVGHPLTVYGK,ox,C,327,true,"OxiTRAQ SA and flg22 responses - SA vs mock",91a,25720653,"MASCOT Score",60.9800000,,0.8237494,0.0080000,YES,,
FCVQAAVGHPLTVYGK,ox,C,327,true,"OxiTRAQ SA and flg22 responses - flg22 vs mock",91b,25720653,"MASCOT Score",60.9800000,,0.4956952,0.3170000,NO,,
GKGGQTRGY,nt,G,340,true,"Arabidopsis translation initiation landscape - NT",167b,35069635,,,,,,,,
DTVQCVEIAIANPAK,sno,C,357,true,"Endogenous S-nitrosylation in Arabidopsis",64,22115780,"MASCOT Score",66.0000000,,,,,,
