Peptide,PTM,ModifiedAA,ModifiedPosition,PeptideUniqueToGene,ExperimentDesc,ExpID,PubmedID,ScoreType,IdentScore,LocProb,Log2FChange,PQ-val,QuantSig,PEP,MassErrorPPM
YVSSLSPFISTPR,ph,T,49,true,"TOR Kinase and ABA Receptor",100,29290610,XCorr,4.4794006,0.9997000,,,,3.7379999412224E-5,
ISVDAVKPSDTFPRRHNSATPDEQTHMAKF,nt,I,68,true,"Arabidopsis translation initiation landscape - NT",167b,35069635,,,,,,,,
ISVDAVKPSDTFPRRHN,nt,I,68,true,"HUNTER N-terminome: legumain, GluC and trypsin",119,31951383,"MaxQuant score",167.2900000,,,,,,
ISVDAVKPSDTFPR,nt,I,68,true,"Arg/N-end rule pathway Roots",80,25728785,"MASCOT Score",40.9700000,,,,,0.00062780000735074,
ISVDAVKPSDTFPR,nt,I,68,true,"N-terminal ChaFRADIC",92,26010716,"MASCOT Score",37.4000000,,,,,8.4100001629395E-8,
ISVDAVKPSDTFPR,nt,I,68,true,"Stromal N-terminome",96,26371235,"MASCOT Score",81.0000000,,,,,,
ISVDAVKPSDTFPR,nt,I,68,true,"HUNTER N-terminome: legumain, GluC and trypsin",119,31951383,"MaxQuant score",161.9900000,,,,,,
ISVDAVKPSDTFPR,nt,I,68,true,"Mitochondrial intermediate peptidases - icp55 / WT",131a,25732537,,92.7500000,,-0.3638334,,,,
ISVDAVKPSDTFPR,nt,I,68,true,"Mitochondrial intermediate peptidases - oct1-1 / WT",131b,25732537,,90.1100000,,-0.1277888,,,,
ISVDAVKPSDTFPR,nt,I,68,true,"Mitochondrial intermediate peptidases - oct1-2 / WT",131c,25732537,,88.0100000,,-0.3179425,,,,
ISVDAVKPSD,nt,I,68,true,"HUNTER N-terminome: legumain, GluC and trypsin",119,31951383,"MaxQuant score",119.2200000,,,,,,
ISVDAVKPSDTFPR,nta,I,68,true,"N-terminal ChaFRADIC",92,26010716,"MASCOT Score",21.8900000,,,,,0.00096849998226389,
SVDAVKPSDTFPR,nt,S,69,true,"Mitochondrial intermediate peptidases - oct1-1 / WT",131b,25732537,,65.1400000,,-0.9653864,,,,
SVDAVKPSDTFPR,nt,S,69,true,"Mitochondrial intermediate peptidases - oct1-2 / WT",131c,25732537,,62.8800000,,-0.7818867,,,,
SATPDEQTHMA,nt,S,85,true,"N-terminal ChaFRADIC",92,26010716,"MASCOT Score",35.9600000,,,,,0.00027729998691939,
RHNSATPDEQTHMAK,ph,T,92,true,"TOR Kinase and ABA Receptor",100,29290610,XCorr,2.7424467,0.8200000,,,,0.039459999650717,
FCGFDHIDSLIDATVPK,sno,C,98,true,"Site-specific nitrosomeproteomic id - gsnor1-3",90a,25699590,XCorr,3.1069350,,,,,1.2010000318696E-6,-3.7635469
FCGFDHIDSLIDATVPK,sno,C,98,true,"Site-specific nitrosomeproteomic id - gsnor1-3",90b,25699590,XCorr,3.2700000,,,,,0.00011079999967478,-6.9100000
SIRLDSMK,mox,M,120,false,"cat2 Methionine oxidation - 1h stress",62a,25693801,"MASCOT Score",39.0000000,,0.1435870,,NO,,
SIRLDSMK,mox,M,120,false,"cat2 Methionine oxidation - 3h stress",62b,25693801,"MASCOT Score",43.0000000,,-0.1790370,,NO,,
LDSMKFSK,ac,K,121,true,"Quantitative Acetylproteomics",101,29440448,,,,,,,,
SQMIQHMVD,nt,S,132,true,"N-terminal ChaFRADIC",92,26010716,"MASCOT Score",20.0200000,,,,,0.080179996788502,
SLLNFQTVITD,nt,S,193,true,"N-terminal ChaFRADIC",92,26010716,"MASCOT Score",43.8100000,,,,,0.00012749999586958,
TFVIASNCHPQTIDVCK,acy,C,245,false,"Arabidopsis S-acylation atlas - Silique",163e,35681017,,,,,,,,
TFVIASNCHPQTIDVCK,sno,C,245,false,"Site-specific nitrosomeproteomic id - gsnor1-3",90a,25699590,XCorr,2.4667766,,,,,0.29559999704361,-6.1619922
TFVIASNCHPQTIDVCK,sno,C,245,false,"Site-specific nitrosomeproteomic id - gsnor1-3",90b,25699590,XCorr,2.3000000,,,,,0.0014550000196323,-6.1600000
TFVIASNCHPQTIDVCK,acy,C,253,false,"Arabidopsis S-acylation atlas - Silique",163e,35681017,,,,,,,,
GVLVQYPGTE,nt,G,281,false,"Arg/N-end rule seed, prt6 vs. Wt",99,29168982,"MASCOT Score",32.3900000,,-0.6433560,0.0089653,NO,0.00015419999544974,-0.7025866
VLVQYPGTE,nt,V,282,false,"Arg/N-end rule seed, prt6 vs. Wt",99,29168982,"MASCOT Score",42.2200000,,-0.2113411,0.4659702,NO,0.03685000166297,-1.6364848
CSDAHAIADAASK,sno,C,463,true,"Site-specific nitrosomeproteomic id - gsnor1-3",90a,25699590,XCorr,4.2835398,,,,,9.394000244356E-7,-6.1721945
CSDAHAIADAASK,sno,C,463,true,"Site-specific nitrosomeproteomic id - gsnor1-3",90b,25699590,XCorr,3.3868673,,,,,0.032919999212027,-6.9570996
CSDAHAIADAASK,sno,C,463,true,"hot5-4 / wildtype, FAT-switch S-nitrosoproteome",169,37277371,,,,,,,,
IKCSDAHAIADAASK,so,C,463,true,"Arabidopsis S-sulfenylation chemoproteomics",108,31578252,"pFind PSM Score",0.0034525,,1.7480100,,,,0.4566472
CSDAHAIADAASKSEINLR,ph,S,476,true,"Tissue atlas Arabidopsis - ProteomicsDB",114,32188942,"MaxQuant score",76.4170000,0.9904760,,,,4.3388601625338E-5,
DLSLCHSMIPLGSCTMK,ox,C,569,false,"SPEAR - 50 mM H2O2 / mock",138b,34619326,,,,1.6010036,0.0144669,YES,,
TFCIPHGGGGPGMGPIGVK,acy,C,777,false,"Arabidopsis S-acylation atlas - Stem",163f,35681017,,,,,,,,
TFCIPHGGGGPGMGPIGVK,ox,C,777,false,"Redox kickstart of mitochondria",112,31871212,,,,-1.3982554,0.0022979,YES,,
TFCIPHGGGGPGMGPIGVK,sno,C,777,false,"Site-specific nitrosomeproteomic id - gsnor1-3",90a,25699590,XCorr,3.4748077,,,,,4.8449999212608E-7,-5.2944670
TFCIPHGGGGPGMGPIGVK,sno,C,777,false,"Site-specific nitrosomeproteomic id - gsnor1-3",90b,25699590,XCorr,4.2900000,,,,,0.0089309997856617,-6.9300000
TFCIPHGGGGPGMGPIGVK,so,C,777,false,"Arabidopsis S-sulfenylation chemoproteomics",108,31578252,"pFind PSM Score",0.0043879,,,,,,-0.3866670
TFCIPHGGGGPGMGPIGVK,so,C,777,false,"S-sulfenylation site detection using YAP1C",110,32714340,,,,,,,,
IAILNANYMAK,mox,M,863,false,"cat2 Methionine oxidation - 1h stress",62a,25693801,"MASCOT Score",66.0000000,,0.0992294,,NO,,
IAILNANYMAK,mox,M,863,false,"cat2 Methionine oxidation - 3h stress",62b,25693801,"MASCOT Score",77.0000000,,-0.2437435,,NO,,
IAILNANYMAKR,ac,K,865,false,"Quantitative Acetylproteomics",101,29440448,,,,,,,,
RLEKHYPVLFR,ac,K,869,true,"Quantitative Acetylproteomics",101,29440448,,,,,,,,
LEKHYPVLFR,ac,K,869,true,"Histone deacetylases - apicidin vs control",98a,29061669,"MaxQuant Score",50.1000000,1.0000000,0.5330000,0.1000000,NO,0.013000000268221,
LEKHYPVLFR,ac,K,869,true,"Quantitative Acetylproteomics",101,29440448,,,,,,,,
GFKNTAGIEPEDVAKR,ac,K,894,false,"Quantitative Acetylproteomics",101,29440448,,,,,,,,
GFKNTAGIEPEDVAK,ac,K,894,false,"Quantitative Acetylproteomics",101,29440448,,,,,,,,
NTAGIEPEDVAKR,ac,K,906,false,"Quantitative Acetylproteomics",101,29440448,,,,,,,,
FCDALISIR,sno,C,943,false,"Cold stress nitrosylation - 4°C vs 22°C",65,24388526,,,,,,,,
AELDRFCDALISIR,so,C,943,false,"Arabidopsis S-sulfenylation chemoproteomics",108,31578252,"pFind PSM Score",0.0019578,,,,,,-1.3039439
FCDALISIR,so,C,943,false,"S-sulfenylation site detection using YAP1C",110,32714340,,,,,,,,
SSKFWPTTGR,ph,S,1002,false,"atm and atr DNA damage response",88,25561503,"MASCOT Score",26.0000000,0.9980000,,,,,1.9400000
