Peptide,PTM,ModifiedAA,ModifiedPosition,PeptideUniqueToGene,ExperimentDesc,ExpID,PubmedID,ScoreType,IdentScore,LocProb,Log2FChange,PQ-val,QuantSig,PEP,MassErrorPPM
SGEDGSVSHSGSVVER,ph,S,519,true,"Tissue atlas Arabidopsis - ProteomicsDB",114,32188942,"MaxQuant score",76.8260000,0.9850330,,,,0.00037663700641133,
RPPSEEIEADNLNTECTELTDLAR,ph,S,584,true,"Large-scale phosphorylation discovery",44,23111157,XCorr,6.8650000,,,,,,
RPPSEEIEADNLNTECTELTDLAR,ph,S,584,true,"Tissue atlas Arabidopsis - ProteomicsDB",114,32188942,"MaxQuant score",177.3400000,1.0000000,,,,0,
SVSISGTDSPLLPSR,ph,S,663,true,"Tissue atlas Arabidopsis - ProteomicsDB",114,32188942,"MaxQuant score",199.3700000,0.9995360,,,,8.6900497662638E-35,
SVSISGTDSPLLPSR,ph,S,669,true,"Large-scale phosphorylation discovery",44,23111157,XCorr,4.3070000,,,,,,
SVSISGTDSPLLPSR,ph,S,669,true,"SnRK2 protein kinase substrates",85,23776212,XCorr,2.6262825,0.9730000,,,,0.034522499889135,
SVSISGTDSPLLPSR,ph,S,669,true,"TOR Kinase and ABA Receptor",100,29290610,XCorr,4.1353540,0.9143000,,,,4.3469999582157E-6,
SVSISGTDSPLLPSR,ph,S,669,true,"Tissue atlas Arabidopsis - ProteomicsDB",114,32188942,"MaxQuant score",254.7200000,0.9999660,,,,0,
