Peptide,PTM,ModifiedAA,ModifiedPosition,PeptideUniqueToGene,ExperimentDesc,ExpID,PubmedID,ScoreType,IdentScore,LocProb,Log2FChange,PQ-val,QuantSig,PEP,MassErrorPPM
APTTPLESLQGDLK,ph,T,10,true,"Tissue atlas Arabidopsis - ProteomicsDB",114,32188942,"MaxQuant score",184.8700000,0.9997610,,,,1.7308100509754E-22,
KLDSYYASGLLDQCQSSPLIALQNK,ph,S,203,true,"Tissue atlas Arabidopsis - ProteomicsDB",114,32188942,"MaxQuant score",112.1300000,0.9793600,,,,5.0230300359213E-22,
TTTATEDQLPGVSNDAK,ph,S,335,true,"Tissue atlas Arabidopsis - ProteomicsDB",114,32188942,"MaxQuant score",145.8200000,1.0000000,,,,3.0667400043038E-12,
LVPLNSFSSPSR,ph,S,542,true,"Tissue atlas Arabidopsis - ProteomicsDB",114,32188942,"MaxQuant score",107.1400000,0.9788810,,,,7.8257697168738E-5,
LVPLNSFSSPSR,ph,S,544,true,"Lateral root-induction - NAA vs control",106,23328941,"MASCOT Score",21.0000000,,,,,,
LVPLNSFSSPSR,ph,S,544,true,"Tissue atlas Arabidopsis - ProteomicsDB",114,32188942,"MaxQuant score",150.2100000,0.7775420,,,,5.689050226465E-7,
LVPLNSFSSPSR,ph,S,545,true,"TOR Kinase and ABA Receptor",100,29290610,XCorr,2.2711594,0.9081000,,,,0.0028270001057535,
LVPLNSFSSPSR,ph,S,545,true,"Lateral root-induction - NAA vs control",106,23328941,"MASCOT Score",27.0000000,,,,,,
LVPLNSFSSPSR,ph,S,545,true,"Tissue atlas Arabidopsis - ProteomicsDB",114,32188942,"MaxQuant score",187.1100000,0.9692550,,,,3.0277799255639E-20,
LVPLNSFSSPSR,ph,S,547,true,"Tissue atlas Arabidopsis - ProteomicsDB",114,32188942,"MaxQuant score",164.2200000,0.8361270,,,,1.853600051227E-10,
QEYSPFGIR,ph,S,599,true,"Tissue atlas Arabidopsis - ProteomicsDB",114,32188942,"MaxQuant score",115.8200000,0.9999990,,,,0.00038313798722811,
QLMISSMNCTTPLR,ph,T,615,true,"Tissue atlas Arabidopsis - ProteomicsDB",114,32188942,"MaxQuant score",137.2100000,0.9903390,,,,7.5157599894737E-6,
HRDLLSPVLDR,ph,S,656,true,"Tissue atlas Arabidopsis - ProteomicsDB",114,32188942,"MaxQuant score",110.9300000,1.0000000,,,,0.00016188800509553,
DLLSPVLDR,ph,S,656,true,"srk2dei ABA signaling phopshoproteomics",83,23572148,"MASCOT Score",20.0000000,,,,,,-0.0011000
AATSSLANDFSR,ph,S,673,true,"Tissue atlas Arabidopsis - ProteomicsDB",114,32188942,"MaxQuant score",100.2200000,0.9433190,,,,0.00013049799599685,
NICASPSIAR,ph,S,709,true,"Large-scale phosphorylation discovery",44,23111157,XCorr,2.9630000,,,,,,
NICASPSIAR,ph,S,709,true,"Lateral root-induction - NAA vs control",106,23328941,"MASCOT Score",25.0000000,,,,,,
NICASPSIAR,ph,S,709,true,"Tissue atlas Arabidopsis - ProteomicsDB",114,32188942,"MaxQuant score",127.1700000,0.9925250,,,,6.6714899730869E-5,
NICASPSIAR,ph,S,711,true,"Tissue atlas Arabidopsis - ProteomicsDB",114,32188942,"MaxQuant score",79.2300000,0.7976410,,,,0.003185800043866,
