Peptide,PTM,ModifiedAA,ModifiedPosition,PeptideUniqueToGene,ExperimentDesc,ExpID,PubmedID,ScoreType,IdentScore,LocProb,Log2FChange,PQ-val,QuantSig,PEP,MassErrorPPM
SIPCLTEETAKTVLR,nt,S,2,true,"Stromal N-terminome",96,26371235,"MASCOT Score",83.8500000,,,,,,
SIPCLTEETAKTVLR,nta,S,2,true,"Arg/N-end rule pathway Roots",80,25728785,"MASCOT Score",73.6400000,,,,,8.0359997809865E-5,
SIPCLTEETAKTVLR,nta,S,2,true,"Stromal N-terminome",96,26371235,"MASCOT Score",83.8500000,,,,,,
SIPCLTEETAKTVLR,nta,S,2,true,"HUNTER N-terminome: legumain, GluC and trypsin",119,31951383,"MaxQuant score",42.0950000,,,,,,
SIPCLTEETAKTVLR,nta,S,2,true,"Arabidopsis translation initiation landscape - NTA",167a,35069635,,,,,,,,
SIPCLTEETAK,so,C,5,true,"S-sulfenylation site detection using YAP1C",110,32714340,,,,,,,,
STELLKLEDLIEQLNAR,sumo,K,105,true,"SUMO Ligase SIZ1 heat stress",4,29588388,,,,,,,,
TVAASPFSYDVK,ph,S,121,true,"Tissue atlas Arabidopsis - ProteomicsDB",114,32188942,"MaxQuant score",121.2400000,0.9995170,,,,3.361939889146E-5,
TVAASPFSYDVKREDVESFFSQYGK,sumo,K,128,true,"SUMO Ligase SIZ1 heat stress",4,29588388,,,,,,,,
TVAASPFSYDVKR,ub,K,128,true,"Arabidopsis ubiquitination COFRADIC",40,26744219,"MaxQuant Score",88.1010000,1.0000000,,,,1.1189999895578E-5,0.6660000
EDVESFFSQYGKVNSVR,ub,K,141,true,"Arabidopsis ubiquitination COFRADIC",40,26744219,"MaxQuant Score",86.3670000,1.0000000,,,,5.1970001246253E-14,-1.4580000
FANYQPQKGSANQK,ph,S,214,true,"Tissue atlas Arabidopsis - ProteomicsDB",114,32188942,"MaxQuant score",118.2900000,1.0000000,,,,7.4994903116021E-5,
RSAEEGTTEQKSSEEPTDK,ph,S,256,true,"TOR Kinase and ABA Receptor",100,29290610,XCorr,4.1215086,0.9982000,,,,0.018689999356866,
SAEEGTTEQKSSEEPTDK,ph,S,256,true,"SnRK2 protein kinase substrates",85,23776212,XCorr,3.5527394,0.9920000,,,,0.001899529946968,
SAEEGTTEQKSSEEPTDK,ph,S,256,true,"atm and atr DNA damage response",88,25561503,"MASCOT Score",36.0000000,0.9960000,,,,,-2.0900000
SAEEGTTEQKSSEEPTDK,ph,S,256,true,"Tissue atlas Arabidopsis - ProteomicsDB",114,32188942,"MaxQuant score",223.0700000,0.9994870,,,,0,
RSAEEGTTEQKSSEEPTDK,ph,S,257,true,"TOR Kinase and ABA Receptor",100,29290610,XCorr,4.1215086,0.9995000,,,,0.018689999356866,
SAEEGTTEQKSSEEPTDK,ph,S,257,true,"Tissue atlas Arabidopsis - ProteomicsDB",114,32188942,"MaxQuant score",443.5400000,0.9993680,,,,0,
TMEESETKPADTPDADKENTGEVQAEGAEDEDDEKEEK,ph,T,275,true,"PAMP-triggered phosphorylation",48,24601666,"MASCOT Score",39.2000000,,,,,,
TMEESETKPADTPDADKENTGEVQAEGAEDEDDEKEEK,ph,T,275,true,"LAXIC - mannitol vs control",84b,23660473,XCorr,6.2500000,0.9730000,,,,6.4500000392792E-13,
TMEESETKPADTPDADKENTGEVQAEGAEDEDDEKEEK,ph,T,275,true,"SnRK2 protein kinase substrates",85,23776212,XCorr,5.2327023,0.9800000,,,,1.9216000509914E-5,
TMEESETKPADTPDADK,ph,T,275,true,"Conserved plant phosphoproteome - Arabidopsis",61a,20466843,"MASCOT Score",56.0000000,1.0000000,,,,,
TMEESETKPADTPDADK,ph,T,275,true,"srk2dei ABA signaling phopshoproteomics",83,23572148,"MASCOT Score",49.0000000,,,,,,0.0001000
TMEESETKPADTPDADK,ph,T,275,true,"TOR Kinase and ABA Receptor",100,29290610,XCorr,5.7569065,1.0000000,,,,1.120999968407E-6,
TMEESETKPADTPDADK,ph,T,275,true,"Lateral root-induction - NAA vs control",106,23328941,"MASCOT Score",54.0000000,,-0.0004600,0.9214653,NO,,
TMEESETKPADTPDADK,ph,T,275,true,"Tissue atlas Arabidopsis - ProteomicsDB",114,32188942,"MaxQuant score",98.7030000,0.9998840,,,,3.1351301004179E-6,
FDEPEASQKAR,ub,K,353,true,"Arabidopsis ubiquitination COFRADIC",40,26744219,"MaxQuant Score",147.1900000,1.0000000,,,,2.7040000487723E-14,0.0310000
