Peptide,PTM,ModifiedAA,ModifiedPosition,PeptideUniqueToGene,ExperimentDesc,ExpID,PubmedID,ScoreType,IdentScore,LocProb,Log2FChange,PQ-val,QuantSig,PEP,MassErrorPPM
KVVSLSSFK,ph,S,63,true,"atm and atr DNA damage response",88,25561503,"MASCOT Score",41.0000000,0.9940000,,,,,-4.5700000
KVVSLSSFKK,ph,S,65,true,"srk2dei ABA signaling phopshoproteomics",83,23572148,"MASCOT Score",21.0000000,,,,,,0.0014000
KVVSLSSFK,ph,S,65,true,"Tissue atlas Arabidopsis - ProteomicsDB",114,32188942,"MaxQuant score",76.3020000,0.8190590,,,,0.0045825601555407,
VVSLSSFKK,ph,S,66,true,"Tissue atlas Arabidopsis - ProteomicsDB",114,32188942,"MaxQuant score",155.0000000,0.9938950,,,,6.3490697357338E-5,
KVGSQNESILDK,ph,S,72,true,"atm and atr DNA damage response",88,25561503,"MASCOT Score",46.0000000,1.0000000,,,,,-1.6200000
SAGESDSQEELVVNIPK,ph,S,144,true,"Tissue atlas Arabidopsis - ProteomicsDB",114,32188942,"MaxQuant score",145.6900000,0.9999130,,,,3.1161601077301E-12,
SAGESDSQEELVVNIPK,ph,S,148,true,"Tissue atlas Arabidopsis - ProteomicsDB",114,32188942,"MaxQuant score",310.9000000,0.9999880,,,,0,
SAGESDSQEELVVNIPK,ph,S,150,true,"Tissue atlas Arabidopsis - ProteomicsDB",114,32188942,"MaxQuant score",352.5900000,0.9999990,,,,0,
VTAEESSVQDQPSKVEEK,ph,S,167,true,"Tissue atlas Arabidopsis - ProteomicsDB",114,32188942,"MaxQuant score",166.9100000,0.9475080,,,,5.1749400567945E-28,
ESNSAAPLQLENGHSNQSPVKDDQLVVVK,ph,S,200,true,"Tissue atlas Arabidopsis - ProteomicsDB",114,32188942,"MaxQuant score",168.6500000,0.8717320,,,,0,
ESNSAAPLQLENGHSNQSPVKDDQLVVVK,ph,S,203,true,"Tissue atlas Arabidopsis - ProteomicsDB",114,32188942,"MaxQuant score",319.7800000,0.9985260,,,,0,
VGKEAKSSGDASGR,ub,K,237,true,"Arabidopsis ubiquitination COFRADIC",40,26744219,"MaxQuant Score",44.2520000,0.9420000,,,,0.0049999998882413,-0.5080000
FDPNCTQFPSNSVTPGSPSASR,ph,S,286,true,"TOR Kinase and ABA Receptor",100,29290610,XCorr,3.6255610,0.9154000,,,,0.0060279997996986,
FDPNCTQFPSNSVTPGSPSASR,ph,S,286,true,"Tissue atlas Arabidopsis - ProteomicsDB",114,32188942,"MaxQuant score",292.0900000,0.9978880,,,,0,
CVSDDTDDR,ph,S,315,true,"atm and atr DNA damage response",88,25561503,"MASCOT Score",49.0000000,1.0000000,,,,,-0.0700000
NELESSGFR,ph,S,524,true,"Tissue atlas Arabidopsis - ProteomicsDB",114,32188942,"MaxQuant score",106.1600000,0.7712730,,,,0.0006671299925074,
SKSQTDEPIITSSR,ph,S,855,true,"Tissue atlas Arabidopsis - ProteomicsDB",114,32188942,"MaxQuant score",62.2810000,0.8323830,,,,0.00077876599971205,
SKSQTDEPIITSSR,ac,K,856,true,"Quantitative Acetylproteomics",101,29440448,,,,,,,,
SKSQTDEPIITSSR,ph,S,857,true,"Tissue atlas Arabidopsis - ProteomicsDB",114,32188942,"MaxQuant score",100.5800000,0.9570310,,,,0.0002391760062892,
DLHTPSQSQQLGSDSENWMSYSSSVVR,ph,S,886,true,"TOR Kinase and ABA Receptor",100,29290610,XCorr,3.6823199,0.9603000,,,,0.0024810000322759,
DLHTPSQSQQLGSDSENWMSYSSSVVR,ph,S,886,true,"Tissue atlas Arabidopsis - ProteomicsDB",114,32188942,"MaxQuant score",102.0100000,0.9565550,,,,3.3908099276142E-22,
SKSSLNGHLSHGWSDSK,ph,S,960,true,"Tissue atlas Arabidopsis - ProteomicsDB",114,32188942,"MaxQuant score",95.3650000,0.8928050,,,,2.0992699774069E-6,
VMYDMDSDDEQCLLR,ph,S,1192,true,"Tyrosine phosphorylation in Arabidopsis",59,18463617,"MASCOT Score",54.0000000,,,,,,-0.6603244
VMYDMDSDDEQCLLR,ph,S,1192,true,"Conserved plant phosphoproteome - Arabidopsis",61a,20466843,"MASCOT Score",71.0000000,1.0000000,,,,,
VMYDMDSDDEQCLLR,ph,S,1192,true,"srk2dei ABA signaling phopshoproteomics",83,23572148,"MASCOT Score",76.0000000,,,,,,-0.0009000
VMYDMDSDDEQCLLR,ph,S,1192,true,"SnRK2 protein kinase substrates",85,23776212,XCorr,3.0829952,1.0000000,,,,3.96250006599E-16,
VMYDMDSDDEQCLLR,ph,S,1192,true,"atm and atr DNA damage response",88,25561503,"MASCOT Score",45.0000000,1.0000000,,,,,-0.0500000
VMYDMDSDDEQCLLR,ph,S,1192,true,"Phospho cell culture sucrose/TOR",109,30833711,,,1.0000000,,,,,
VMYDMDSDDEQCLLR,ph,S,1192,true,"Tissue atlas Arabidopsis - ProteomicsDB",114,32188942,"MaxQuant score",225.0900000,1.0000000,,,,0,
GLEVKHR,ac,K,1334,true,"Histone deacetylases - apicidin vs control",98a,29061669,"MaxQuant Score",121.3000000,1.0000000,-0.2900000,0.2958012,NO,0.0040000001899898,
GLEVKHR,ac,K,1334,true,"Histone deacetylases- hda14 vs WT (low light)",98c,29061669,"MaxQuant Score",122.1800000,1.0000000,0.2050000,0.9885531,NO,0.0020000000949949,
GLEVKHR,ac,K,1334,true,"Histone deacetylases - hda14 vs WT (thylakoids)",98d,29061669,"MaxQuant Score",136.1000000,1.0000000,0.4120000,0.8394600,NO,1.1899999918796E-7,
GLEVKHR,ac,K,1334,true,"Quantitative Acetylproteomics",101,29440448,,,,,,,,
FLYSNQSYEHSNEFSVHPGTYSPR,ph,T,1398,true,"Tissue atlas Arabidopsis - ProteomicsDB",114,32188942,"MaxQuant score",89.6840000,0.7557000,,,,3.3231299656489E-12,
DLGMGYFSSGGNGYHR,ph,S,1410,true,"atm and atr DNA damage response",88,25561503,"MASCOT Score",54.0000000,0.9450000,,,,,0.2800000
DLGMGYFSSGGNGYHR,ph,S,1410,true,"Tissue atlas Arabidopsis - ProteomicsDB",114,32188942,"MaxQuant score",188.9000000,0.9382000,,,,1.450540041373E-27,
