Peptide,PTM,ModifiedAA,ModifiedPosition,PeptideUniqueToGene,ExperimentDesc,ExpID,PubmedID,ScoreType,IdentScore,LocProb,Log2FChange,PQ-val,QuantSig,PEP,MassErrorPPM
ALCTGEK,ox,C,43,false,"OxiTRAQ Arabidopsis - 5 mM H2O2 versus control",47,24376095,,,,-0.1553836,0.4914629,NO,,
ALCTGEK,sno,C,43,false,"hot5-4 / wildtype, FAT-switch S-nitrosoproteome",169,37277371,,,,,,,,
ALCTGEK,so,C,43,false,"Arabidopsis S-sulfenylation chemoproteomics",108,31578252,"pFind PSM Score",0.0736608,,0.9177400,,,,-0.0130946
ALCTGEK,so,C,43,false,"S-sulfenylation site detection using YAP1C",110,32714340,,,,,,,,
NGTAGESIYAGKFPDESPKLR,ph,S,98,true,"Tissue atlas Arabidopsis - ProteomicsDB",114,32188942,"MaxQuant score",244.5100000,1.0000000,,,,0,
FPDESPKLR,ph,S,98,true,"atm and atr DNA damage response",88,25561503,"MASCOT Score",21.0000000,1.0000000,,,,,-1.5300000
RTGNSAPAVEK,ph,T,319,true,"Tissue atlas Arabidopsis - ProteomicsDB",114,32188942,"MaxQuant score",100.5500000,0.8448040,,,,0.00019229100144003,
RTGNSAPAVEK,ph,S,322,true,"atm and atr DNA damage response",88,25561503,"MASCOT Score",53.0000000,1.0000000,,,,,0.6800000
RTGNSAPAVEK,ph,S,322,true,"TOR Kinase and ABA Receptor",100,29290610,XCorr,2.4606907,0.9816000,,,,0.047899998724461,
TGNSAPAVEK,ph,S,322,true,"atm and atr DNA damage response",88,25561503,"MASCOT Score",45.0000000,1.0000000,,,,,-0.8800000
TGNSAPAVEK,ph,S,322,true,"Tissue atlas Arabidopsis - ProteomicsDB",114,32188942,"MaxQuant score",99.9270000,0.9999970,,,,6.498319999082E-5,
EAESLHQGKR,ph,S,332,true,"Tissue atlas Arabidopsis - ProteomicsDB",114,32188942,"MaxQuant score",57.8020000,1.0000000,,,,0.0035103899426758,
SNGISDAASEQISDR,ph,S,355,true,"Tissue atlas Arabidopsis - ProteomicsDB",114,32188942,"MaxQuant score",98.4210000,0.7696920,,,,2.6108900783584E-5,
SNGISDAASEQISDR,ph,S,359,true,"Tissue atlas Arabidopsis - ProteomicsDB",114,32188942,"MaxQuant score",260.3800000,1.0000000,,,,0,
SNGISDAASEQISDR,ph,S,363,true,"Tyrosine phosphorylation in Arabidopsis",59,18463617,"MASCOT Score",26.0000000,,,,,,-0.1227998
SNGISDAASEQISDR,ph,S,363,true,"Tissue atlas Arabidopsis - ProteomicsDB",114,32188942,"MaxQuant score",285.2600000,1.0000000,,,,0,
QPDIVDDHPSKSRSR,ph,S,375,true,"Tissue atlas Arabidopsis - ProteomicsDB",114,32188942,"MaxQuant score",274.6800000,1.0000000,,,,0,
QPDIVDDHPSKSRSR,ph,S,377,true,"Tissue atlas Arabidopsis - ProteomicsDB",114,32188942,"MaxQuant score",173.4800000,1.0000000,,,,0,
QPDIVDDHPSKSR,ph,S,377,true,"atm and atr DNA damage response",88,25561503,"MASCOT Score",31.0000000,0.9980000,,,,,0.2000000
QPDIVDDHPSKSRSR,ph,S,379,true,"Tissue atlas Arabidopsis - ProteomicsDB",114,32188942,"MaxQuant score",65.8870000,1.0000000,,,,0.00069320999318734,
TVSKSTSVSPR,ph,S,391,true,"Tissue atlas Arabidopsis - ProteomicsDB",114,32188942,"MaxQuant score",96.9560000,0.9443770,,,,0.00017218200082425,
TVSKSTSVSPR,ph,S,393,true,"Tissue atlas Arabidopsis - ProteomicsDB",114,32188942,"MaxQuant score",96.9560000,0.9280360,,,,0.00017218200082425,
TVSKSTSVSPR,ph,S,395,true,"Tissue atlas Arabidopsis - ProteomicsDB",114,32188942,"MaxQuant score",96.9560000,0.9976480,,,,0.00017218200082425,
WNGGRSPAK,ph,S,415,true,"Tissue atlas Arabidopsis - ProteomicsDB",114,32188942,"MaxQuant score",117.4500000,1.0000000,,,,0.00063659599982202,
NLTNSRRESPGSEEK,ph,T,427,true,"Tissue atlas Arabidopsis - ProteomicsDB",114,32188942,"MaxQuant score",63.9360000,0.8969390,,,,0.0053953798487782,
NLTNSRRESPGSEEK,ph,S,429,true,"Tissue atlas Arabidopsis - ProteomicsDB",114,32188942,"MaxQuant score",73.8090000,0.9696900,,,,0.00023116100055631,
RESPGSEEKGR,ph,S,433,true,"atm and atr DNA damage response",88,25561503,"MASCOT Score",23.0000000,1.0000000,,,,,0.2200000
RESPGSEEKGR,ph,S,433,true,"Tissue atlas Arabidopsis - ProteomicsDB",114,32188942,"MaxQuant score",93.8390000,1.0000000,,,,0.00023116100055631,
RESPGSEEK,ph,S,433,true,"Chloroplast kinase substrates",60,19376835,"MASCOT Score",33.5000000,,,,,,0.2597810
RESPGSEEK,ph,S,433,true,"SnRK2 protein kinase substrates",85,23776212,XCorr,2.2103288,0.9500000,,,,0.11383300274611,
RESPGSEEK,ph,S,433,true,"atm and atr DNA damage response",88,25561503,"MASCOT Score",40.0000000,1.0000000,,,,,-1.4900000
RESPGSEEKGR,ph,S,436,true,"atm and atr DNA damage response",88,25561503,"MASCOT Score",23.0000000,1.0000000,,,,,0.2200000
RESPGSEEKGR,ph,S,436,true,"Tissue atlas Arabidopsis - ProteomicsDB",114,32188942,"MaxQuant score",89.4840000,1.0000000,,,,0.00028059200849384,
RESPGSEEK,ph,S,436,true,"atm and atr DNA damage response",88,25561503,"MASCOT Score",40.0000000,1.0000000,,,,,-1.4900000
SLSRSPLRSPK,ph,S,471,true,"Tissue atlas Arabidopsis - ProteomicsDB",114,32188942,"MaxQuant score",56.1450000,1.0000000,,,,0.011392500251532,
SLSRSPLRSPK,ph,S,473,true,"Tissue atlas Arabidopsis - ProteomicsDB",114,32188942,"MaxQuant score",56.1450000,1.0000000,,,,0.011392500251532,
SLSRSPLR,ph,S,473,true,"Phospho cell culture sucrose/TOR",109,30833711,,,1.0000000,,,,,
SLSRSPLRSPK,ph,S,475,true,"Tissue atlas Arabidopsis - ProteomicsDB",114,32188942,"MaxQuant score",56.1450000,1.0000000,,,,0.011392500251532,
SLSRSPLRSPK,ph,S,479,true,"Tissue atlas Arabidopsis - ProteomicsDB",114,32188942,"MaxQuant score",56.1450000,1.0000000,,,,0.011392500251532,
VISRSPVR,ph,S,485,true,"Phospho cell culture sucrose/TOR",109,30833711,,,1.0000000,,,,,
VISRSPVR,ph,S,485,true,"Tissue atlas Arabidopsis - ProteomicsDB",114,32188942,"MaxQuant score",80.0370000,1.0000000,,,,0.0072013097815216,
VISRSPVR,ph,S,487,true,"atm and atr DNA damage response",88,25561503,"MASCOT Score",30.0000000,0.9960000,,,,,-0.9200000
VISRSPVR,ph,S,487,true,"TOR Kinase and ABA Receptor",100,29290610,XCorr,2.2248955,0.9374000,,,,0.011900000274181,
VISRSPVR,ph,S,487,true,"Tissue atlas Arabidopsis - ProteomicsDB",114,32188942,"MaxQuant score",108.4000000,1.0000000,,,,0.0071404399350286,
IARSPSRSPVR,ph,S,496,true,"Phospho cell culture sucrose/TOR",109,30833711,,,1.0000000,,,,,
IARSPSRSPVR,ph,S,496,true,"Tissue atlas Arabidopsis - ProteomicsDB",114,32188942,"MaxQuant score",71.5450000,1.0000000,,,,0.0020662199240178,
IARSPSRSPVR,ph,S,498,true,"Tissue atlas Arabidopsis - ProteomicsDB",114,32188942,"MaxQuant score",71.5450000,1.0000000,,,,0.0020662199240178,
IARSPSRSPVR,ph,S,500,true,"Tissue atlas Arabidopsis - ProteomicsDB",114,32188942,"MaxQuant score",71.5450000,1.0000000,,,,0.0020662199240178,
RSLSRSPIQLSR,ph,S,534,true,"atm and atr DNA damage response",88,25561503,"MASCOT Score",25.0000000,1.0000000,,,,,0.2400000
SLSRSPIQLSR,ph,S,534,true,"srk2dei ABA signaling phopshoproteomics",83,23572148,"MASCOT Score",30.0000000,,,,,,-0.0002000
SLSRSPIQLSR,ph,S,534,true,"atm and atr DNA damage response",88,25561503,"MASCOT Score",29.0000000,1.0000000,,,,,-0.8300000
SLSRSPIQLSR,ph,S,534,true,"Phospho cell culture sucrose/TOR",109,30833711,,,1.0000000,,,,,
SLSRSPIQLSR,ph,S,534,true,"Tissue atlas Arabidopsis - ProteomicsDB",114,32188942,"MaxQuant score",107.6900000,1.0000000,,,,2.7965199478786E-5,
RSLSRSPIQLSR,ph,S,536,true,"atm and atr DNA damage response",88,25561503,"MASCOT Score",25.0000000,1.0000000,,,,,0.2400000
SLSRSPIQLSR,ph,S,536,true,"srk2dei ABA signaling phopshoproteomics",83,23572148,"MASCOT Score",30.0000000,,,,,,-0.0002000
SLSRSPIQLSR,ph,S,536,true,"atm and atr DNA damage response",88,25561503,"MASCOT Score",29.0000000,1.0000000,,,,,-0.8300000
SLSRSPIQLSR,ph,S,536,true,"Tissue atlas Arabidopsis - ProteomicsDB",114,32188942,"MaxQuant score",106.2800000,1.0000000,,,,7.1512498834636E-5,
RSLSRSPIQLSR,ph,S,538,true,"atm and atr DNA damage response",88,25561503,"MASCOT Score",25.0000000,1.0000000,,,,,0.2400000
SLSRSPIQLSR,ph,S,538,true,"srk2dei ABA signaling phopshoproteomics",83,23572148,"MASCOT Score",30.0000000,,,,,,-0.0002000
SLSRSPIQLSR,ph,S,538,true,"atm and atr DNA damage response",88,25561503,"MASCOT Score",29.0000000,1.0000000,,,,,-0.8300000
SLSRSPIQLSR,ph,S,538,true,"Tissue atlas Arabidopsis - ProteomicsDB",114,32188942,"MaxQuant score",117.0300000,1.0000000,,,,7.3667702054081E-6,
SPIQLSR,ph,S,538,true,"STN8 phosphoproteome",38,21768351,"MASCOT Score",47.9400000,,,,,,0.2786560
SPIQLSR,ph,S,538,true,"Phospho cell culture sucrose/TOR",109,30833711,,,0.9999990,,,,,
SLSRSPTRLSR,ph,S,546,true,"Tissue atlas Arabidopsis - ProteomicsDB",114,32188942,"MaxQuant score",51.5930000,0.9997960,,,,0.017808400094509,
SLSRSPTRLSR,ph,S,548,true,"Tissue atlas Arabidopsis - ProteomicsDB",114,32188942,"MaxQuant score",51.5930000,0.9979930,,,,0.017808400094509,
SLSRSPTRLSR,ph,S,550,true,"Tissue atlas Arabidopsis - ProteomicsDB",114,32188942,"MaxQuant score",51.5930000,0.8817990,,,,0.017808400094509,
SLSRSPTRLSR,ph,S,555,true,"Tissue atlas Arabidopsis - ProteomicsDB",114,32188942,"MaxQuant score",51.5930000,0.9208960,,,,0.017808400094509,
SLSRSPIRSPR,ph,S,558,true,"Phospho cell culture sucrose/TOR",109,30833711,,,1.0000000,,,,,
KSVSRSPIR,ph,S,606,true,"Phospho cell culture sucrose/TOR",109,30833711,,,1.0000000,,,,,
SISRSPVR,ph,S,634,true,"Phospho cell culture sucrose/TOR",109,30833711,,,1.0000000,,,,,
RISRSPVPAR,ph,S,643,true,"Phospho cell culture sucrose/TOR",109,30833711,,,1.0000000,,,,,
RISRSPVPAR,ph,S,643,true,"Tissue atlas Arabidopsis - ProteomicsDB",114,32188942,"MaxQuant score",67.0950000,1.0000000,,,,0.0051276599988341,
ISRSPVPAR,ph,S,643,true,"atm and atr DNA damage response",88,25561503,"MASCOT Score",21.0000000,1.0000000,,,,,0.4000000
RISRSPVPAR,ph,S,645,true,"Tissue atlas Arabidopsis - ProteomicsDB",114,32188942,"MaxQuant score",67.0950000,1.0000000,,,,0.0051276599988341,
ISRSPVPAR,ph,S,645,true,"atm and atr DNA damage response",88,25561503,"MASCOT Score",21.0000000,1.0000000,,,,,0.4000000
SVRPRSPPPDR,ph,S,653,true,"Phospho cell culture sucrose/TOR",109,30833711,,,1.0000000,,,,,
SVRPRSPPPDR,ph,S,653,true,"Tissue atlas Arabidopsis - ProteomicsDB",114,32188942,"MaxQuant score",78.4410000,1.0000000,,,,0.00092220597434789,
SVRPRSPPPDR,ph,S,658,true,"Tissue atlas Arabidopsis - ProteomicsDB",114,32188942,"MaxQuant score",83.8560000,1.0000000,,,,0.00026269600493833,
PRSPPPDR,ph,S,658,true,"atm and atr DNA damage response",88,25561503,"MASCOT Score",38.0000000,1.0000000,,,,,-0.3500000
GFSQRFSYAR,ph,S,688,true,"Tissue atlas Arabidopsis - ProteomicsDB",114,32188942,"MaxQuant score",92.0390000,0.9999800,,,,0.00026182000874542,
YRTSPSPDRSPYR,ph,T,695,true,"srk2dei ABA signaling phopshoproteomics",83,23572148,"MASCOT Score",23.0000000,,,,,,-0.0015000
YRTSPSPDRSPYR,ph,T,695,true,"Phospho cell culture sucrose/TOR",109,30833711,,,0.7777560,,,,,
YRTSPSPDRSPYR,ph,T,695,true,"Tissue atlas Arabidopsis - ProteomicsDB",114,32188942,"MaxQuant score",98.5730000,0.8753020,,,,0.0011316200252622,
YRTSPSPDRSPYR,ph,S,696,true,"srk2dei ABA signaling phopshoproteomics",83,23572148,"MASCOT Score",28.0000000,,,,,,-0.0043000
YRTSPSPDRSPYR,ph,S,696,true,"TOR Kinase and ABA Receptor",100,29290610,XCorr,4.4588656,0.8897000,,,,0.001081999973394,
YRTSPSPDRSPYR,ph,S,696,true,"Phospho cell culture sucrose/TOR",109,30833711,,,0.8378770,,,,,
YRTSPSPDRSPYR,ph,S,696,true,"Tissue atlas Arabidopsis - ProteomicsDB",114,32188942,"MaxQuant score",157.8200000,0.9767430,,,,8.5470902577711E-10,
YRTSPSPDRSPYR,ph,S,698,true,"Conserved plant phosphoproteome - Arabidopsis",61a,20466843,"MASCOT Score",26.0000000,1.0000000,,,,,
YRTSPSPDRSPYR,ph,S,698,true,"srk2dei ABA signaling phopshoproteomics",83,23572148,"MASCOT Score",28.0000000,,,,,,-0.0043000
YRTSPSPDRSPYR,ph,S,698,true,"TOR Kinase and ABA Receptor",100,29290610,XCorr,4.4588656,0.9990000,,,,0.001081999973394,
YRTSPSPDRSPYR,ph,S,698,true,"Phospho cell culture sucrose/TOR",109,30833711,,,0.9991280,,,,,
YRTSPSPDRSPYR,ph,S,698,true,"Tissue atlas Arabidopsis - ProteomicsDB",114,32188942,"MaxQuant score",157.8200000,0.9998880,,,,8.5470902577711E-10,
YRTSPSPDRSPYR,ph,S,702,true,"TOR Kinase and ABA Receptor",100,29290610,XCorr,4.4588656,0.9830000,,,,0.001081999973394,
YRTSPSPDRSPYR,ph,S,702,true,"Phospho cell culture sucrose/TOR",109,30833711,,,0.9981850,,,,,
YRTSPSPDRSPYR,ph,S,702,true,"Tissue atlas Arabidopsis - ProteomicsDB",114,32188942,"MaxQuant score",157.8200000,0.9992620,,,,8.5470902577711E-10,
RFSPSR,ph,S,722,false,"Chloroplast kinase substrates",60,19376835,"MASCOT Score",35.1300000,,,,,,-0.9096840
FRSPLR,ph,S,728,true,"srk2dei ABA signaling phopshoproteomics",83,23572148,"MASCOT Score",20.0000000,,,,,,-0.0001000
SRSVSPGLCYR,ph,S,742,true,"atm and atr DNA damage response",88,25561503,"MASCOT Score",45.0000000,1.0000000,,,,,-0.3500000
SRSVSPGLCYR,ph,S,742,true,"Phospho cell culture sucrose/TOR",109,30833711,,,1.0000000,,,,,
SRSVSPGLCYR,ph,S,742,true,"Tissue atlas Arabidopsis - ProteomicsDB",114,32188942,"MaxQuant score",107.9700000,1.0000000,,,,5.8176799939247E-5,
SRSVSPGLCYR,ph,S,744,true,"atm and atr DNA damage response",88,25561503,"MASCOT Score",45.0000000,1.0000000,,,,,-0.3500000
SVSPGLCYR,ph,S,744,true,"STN8 phosphoproteome",38,21768351,"MASCOT Score",38.9700000,,,,,,
SVSPGLCYR,ph,S,744,true,"Chloroplast kinase substrates",60,19376835,"MASCOT Score",37.1100000,,,,,,-0.9557620
SVSPGLCYR,ph,S,744,true,"Conserved plant phosphoproteome - Arabidopsis",61a,20466843,"MASCOT Score",43.0000000,1.0000000,,,,,
SVSPGLCYR,ph,S,744,true,"srk2dei ABA signaling phopshoproteomics",83,23572148,"MASCOT Score",51.0000000,,,,,,0.0000000
SVSPGLCYR,ph,S,744,true,"LAXIC - mannitol vs control",84b,23660473,XCorr,2.5900000,1.0000000,2.4175142,,NO,0.00062593200709671,
SVSPGLCYR,ph,S,744,true,"SnRK2 protein kinase substrates",85,23776212,XCorr,2.3022912,1.0000000,,,,0.04174479842186,
SVSPGLCYR,ph,S,744,true,"atm and atr DNA damage response",88,25561503,"MASCOT Score",40.0000000,1.0000000,,,,,0.1700000
SVSPGLCYR,ph,S,744,true,"Phospho cell culture sucrose/TOR",109,30833711,,,1.0000000,,,,,
SVSPGLCYR,ph,S,744,true,"Col-0 callus - FC Col-0 vs. Col-0 Xray",111a,31410901,,34.7700000,,0.4228110,0.0000000,NO,,0.2262812
SVSPGLCYR,ph,S,744,true,"Col-0 X-ray callus - FC Col-0 vs. Col-0 Xray",111b,31410901,,34.7700000,,0.4228110,0.0000000,NO,,0.2262812
SVSPGLCYR,ph,S,744,true,"atm callus - FC atm vs. atm Xray",111c,31410901,,34.7700000,,-0.5197190,0.0000000,NO,,0.2262812
SVSPGLCYR,ph,S,744,true,"atm-3 X-ray callus - FC atm vs. atm Xray",111d,31410901,,34.7700000,,-0.5197190,0.0000000,NO,,0.2262812
SVSPGLCYR,ph,S,744,true,"Tissue atlas Arabidopsis - ProteomicsDB",114,32188942,"MaxQuant score",146.1100000,1.0000000,,,,5.8176799939247E-5,
SRSVSPGLCYR,ph,S,746,true,"atm and atr DNA damage response",88,25561503,"MASCOT Score",45.0000000,1.0000000,,,,,-0.3500000
SVSPGLCYR,ph,S,746,true,"Tyrosine phosphorylation in Arabidopsis",59,18463617,"MASCOT Score",65.0000000,,,,,,-0.0894884
SVSPGLCYR,ph,S,746,true,"Chloroplast kinase substrates",60,19376835,"MASCOT Score",37.1100000,,,,,,-0.9557620
SVSPGLCYR,ph,S,746,true,"Conserved plant phosphoproteome - Arabidopsis",61a,20466843,"MASCOT Score",43.0000000,1.0000000,,,,,
SVSPGLCYR,ph,S,746,true,"srk2dei ABA signaling phopshoproteomics",83,23572148,"MASCOT Score",51.0000000,,,,,,0.0000000
SVSPGLCYR,ph,S,746,true,"LAXIC - mannitol vs control",84b,23660473,XCorr,2.5900000,1.0000000,2.4175142,,NO,0.00062593200709671,
SVSPGLCYR,ph,S,746,true,"SnRK2 protein kinase substrates",85,23776212,XCorr,2.3022912,1.0000000,,,,0.04174479842186,
SVSPGLCYR,ph,S,746,true,"atm and atr DNA damage response",88,25561503,"MASCOT Score",40.0000000,1.0000000,,,,,0.1700000
SVSPGLCYR,ph,S,746,true,"Col-0 callus - FC Col-0 vs. Col-0 Xray",111a,31410901,,34.7700000,,0.4228110,0.0000000,NO,,0.2262812
SVSPGLCYR,ph,S,746,true,"Col-0 X-ray callus - FC Col-0 vs. Col-0 Xray",111b,31410901,,34.7700000,,0.4228110,0.0000000,NO,,0.2262812
SVSPGLCYR,ph,S,746,true,"atm callus - FC atm vs. atm Xray",111c,31410901,,34.7700000,,-0.5197190,0.0000000,NO,,0.2262812
SVSPGLCYR,ph,S,746,true,"atm-3 X-ray callus - FC atm vs. atm Xray",111d,31410901,,34.7700000,,-0.5197190,0.0000000,NO,,0.2262812
SVSPGLCYR,ph,S,746,true,"Tissue atlas Arabidopsis - ProteomicsDB",114,32188942,"MaxQuant score",146.1100000,1.0000000,,,,5.8176799939247E-5,
SPSASHSLSPSR,ph,S,773,true,"Tissue atlas Arabidopsis - ProteomicsDB",114,32188942,"MaxQuant score",81.9040000,0.9455330,,,,0.0010178800439462,
SKSYSKSPIGTGK,ph,S,789,true,"Tissue atlas Arabidopsis - ProteomicsDB",114,32188942,"MaxQuant score",90.8060000,0.9992910,,,,0.00026852800510824,
SKSYSKSPIGTGK,ph,S,791,true,"Tissue atlas Arabidopsis - ProteomicsDB",114,32188942,"MaxQuant score",90.8060000,0.9806630,,,,0.00026852800510824,
SYSKSPIGTGK,ph,S,793,true,"Tissue atlas Arabidopsis - ProteomicsDB",114,32188942,"MaxQuant score",94.7810000,0.9993500,,,,0.00010794000263559,
SYSKSPIGTGK,ph,S,795,true,"Tissue atlas Arabidopsis - ProteomicsDB",114,32188942,"MaxQuant score",196.3300000,0.9999910,,,,2.7139800033768E-18,
