Peptide,PTM,ModifiedAA,ModifiedPosition,PeptideUniqueToGene,ExperimentDesc,ExpID,PubmedID,ScoreType,IdentScore,LocProb,Log2FChange,PQ-val,QuantSig,PEP,MassErrorPPM
MEASAGLVAGSYR,nta,M,1,true,"Characterization plant N-terminal acetylation",6,22223895,"MASCOT Score",99.2100000,,,,,,
MEASAGLVAGSYR,nta,M,1,true,"Arg/N-end rule pathway Roots",80,25728785,"MASCOT Score",62.7300000,,,,,9.1819998715437E-7,
MEASAGLVAGSYR,nta,M,1,true,"Arg/N-end rule seed, prt6 vs. Wt",99,29168982,"MASCOT Score",106.4800000,,,,,0.00044020000495948,-2.8082740
MEASAGLVAGSYR,nta,M,1,true,"FtsH12 N-terminome: WT / FtsH12 knockdown miRNA",118,33216923,"MaxQuant score",107.4600000,,0.5343221,0.4206388,NO,2.130000036847E-28,
MEASAGLVAGSYR,nta,M,1,true,"HUNTER N-terminome: legumain, GluC and trypsin",119,31951383,"MaxQuant score",127.8700000,,,,,,
MEASAGLVAGSYR,nta,M,1,true,"Arabidopsis translation initiation landscape - NTA",167a,35069635,,,,,,,,
MEASAGLVAG,nta,M,1,false,"N-term acetylation drought responses",5,26184543,,,,,,,,
MEASAGLVAGSYRR,ph,S,11,true,"atm and atr DNA damage response",88,25561503,"MASCOT Score",29.0000000,0.8970000,,,,,0.1500000
MEASAGLVAGSYRR,ph,S,11,true,"Tissue atlas Arabidopsis - ProteomicsDB",114,32188942,"MaxQuant score",209.6000000,1.0000000,,,,2.9847657290119E-43,
HESDGGTKPLK,ph,S,24,true,"Tissue atlas Arabidopsis - ProteomicsDB",114,32188942,"MaxQuant score",210.4300000,1.0000000,,,,9.8190664953397E-40,
HRGSPRVEGDEDEDDVDDIENEFNYAQGANK,ph,S,94,true,"TOR Kinase and ABA Receptor",100,29290610,XCorr,4.1793661,1.0000000,,,,5.3389998356579E-5,
HGEEFSSSSR,ph,S,133,true,"Tissue atlas Arabidopsis - ProteomicsDB",114,32188942,"MaxQuant score",168.8500000,0.7762320,,,,2.0969700642581E-7,
HGEEFSSSSR,ph,S,134,true,"atm and atr DNA damage response",88,25561503,"MASCOT Score",37.0000000,0.8360000,,,,,0.1900000
HGEEFSSSSR,ph,S,134,true,"Tissue atlas Arabidopsis - ProteomicsDB",114,32188942,"MaxQuant score",158.0200000,0.7720550,,,,7.4759702783922E-7,
HESQPIPLLTHGHTVSGEIRTPDTQSVR,ph,T,146,true,"TOR Kinase and ABA Receptor",100,29290610,XCorr,5.3675404,0.8275000,,,,0.0013109999708831,
HESQPIPLLTHGHTVSGEIR,ph,T,150,true,"Tissue atlas Arabidopsis - ProteomicsDB",114,32188942,"MaxQuant score",243.9000000,0.9965780,,,,0,
HESQPIPLLTHGHTVSGEIRTPDTQSVR,ph,S,152,true,"Large-scale phosphorylation discovery",44,23111157,XCorr,4.2730000,,,,,,
HESQPIPLLTHGHTVSGEIR,ph,S,152,true,"TOR Kinase and ABA Receptor",100,29290610,XCorr,3.2245290,0.8745000,,,,0.0015320000238717,
HESQPIPLLTHGHTVSGEIR,ph,S,152,true,"Tissue atlas Arabidopsis - ProteomicsDB",114,32188942,"MaxQuant score",221.3100000,0.9924370,,,,0,
HESQPIPLLTHGHTVSGEIRTPDTQSVR,ph,T,157,true,"Tissue atlas Arabidopsis - ProteomicsDB",114,32188942,"MaxQuant score",137.3500000,0.9942590,,,,0,
TPDTQSVRTTSGPLGPSDR,ph,S,162,true,"atm and atr DNA damage response",88,25561503,"MASCOT Score",27.0000000,0.9880000,,,,,-1.0100000
TPDTQSVRTTSGPLGPSDR,ph,S,162,true,"Tissue atlas Arabidopsis - ProteomicsDB",114,32188942,"MaxQuant score",103.7500000,0.9776790,,,,2.7952600589742E-7,
TPDTQSVR,ph,S,162,true,"atm and atr DNA damage response",88,25561503,"MASCOT Score",35.0000000,0.9980000,,,,,-0.5900000
TPDTQSVRTTSGPLGPSDR,ph,T,165,true,"atm and atr DNA damage response",88,25561503,"MASCOT Score",27.0000000,0.9880000,,,,,-1.0100000
TTSGPLGPSDR,ph,T,165,true,"Tissue atlas Arabidopsis - ProteomicsDB",114,32188942,"MaxQuant score",103.7500000,0.9432570,,,,2.7952600589742E-7,
TTSGPLGPSDR,ph,S,167,true,"Plasmembrane Ph Immune Responses",25,17651370,,,,,,,,
TTSGPLGPSDR,ph,S,167,true,"STN8 phosphoproteome",38,21768351,"MASCOT Score",52.3900000,,,,,,0.0826843
TTSGPLGPSDR,ph,S,167,true,"Chloroplast kinase substrates",60,19376835,"MASCOT Score",53.9700000,,,,,,-0.4821370
TTSGPLGPSDR,ph,S,167,true,"LAXIC - ABA stress",84a,23660473,XCorr,2.3800000,0.9810000,,,,0.16827900707722,
TTSGPLGPSDR,ph,S,167,true,"atm and atr DNA damage response",88,25561503,"MASCOT Score",48.0000000,0.9940000,,,,,0.7200000
TTSGPLGPSDR,ph,S,167,true,"TOR Kinase and ABA Receptor",100,29290610,XCorr,3.2032423,0.9771000,,,,9.2100002802908E-5,
TTSGPLGPSDR,ph,S,167,true,"Lateral root-induction - NAA vs control",106,23328941,"MASCOT Score",31.0000000,,,,,,
TTSGPLGPSDR,ph,S,167,true,"Tissue atlas Arabidopsis - ProteomicsDB",114,32188942,"MaxQuant score",123.9200000,0.9998210,,,,1.6494399460498E-5,
NAISSPYIDPR,ph,S,179,true,"Lateral root-induction - NAA vs control",106,23328941,"MASCOT Score",24.0000000,,,,,,
NAISSPYIDPR,ph,S,180,true,"Chloroplast kinase substrates",60,19376835,"MASCOT Score",40.9900000,,,,,,0.2341790
NAISSPYIDPR,ph,S,180,true,"TOR Kinase and ABA Receptor",100,29290610,XCorr,3.4623470,0.9383000,,,,0.0055849999189377,
NAISSPYIDPR,ph,S,180,true,"Tissue atlas Arabidopsis - ProteomicsDB",114,32188942,"MaxQuant score",164.1300000,0.9998310,,,,5.1654298893755E-11,
GGEIEGTGSNGEELQMADDTR,ph,T,243,true,"atm and atr DNA damage response",88,25561503,"MASCOT Score",90.0000000,1.0000000,,,,,-0.5900000
GGEIEGTGSNGEELQMADDTR,ph,T,243,true,"Tissue atlas Arabidopsis - ProteomicsDB",114,32188942,"MaxQuant score",153.3600000,0.9997680,,,,5.0467000469989E-26,
GGEIEGTGSNGEELQMADDTRLPMSR,ph,S,245,true,"TOR Kinase and ABA Receptor",100,29290610,XCorr,3.8638980,0.9673000,,,,9.0690002252813E-5,
GGEIEGTGSNGEELQMADDTR,ph,S,245,true,"atm and atr DNA damage response",88,25561503,"MASCOT Score",57.0000000,0.9430000,,,,,0.3700000
GGEIEGTGSNGEELQMADDTR,ph,S,245,true,"Tissue atlas Arabidopsis - ProteomicsDB",114,32188942,"MaxQuant score",249.2600000,0.9999620,,,,0,
DKIQPSFVKER,ub,K,450,false,"Ubiquitination Membrane Proteins",120,33585938,,,,,,,,
IQPSFVKER,ub,K,450,false,"Ubiquitination Membrane Proteins",120,33585938,,,,,,,,
IQPSFVKER,ub,K,450,false,"upl3 mutant / wildtype",168,35926874,"MaxQuant score",64.6540000,1.0000000,0.6789733,,,0.004808260127902,-0.2687400
INALVAKAQK,ub,K,472,false,"Ubiquitination Membrane Proteins",120,33585938,,,,,,,,
INALVAKAQK,ub,K,472,false,"upl3 mutant / wildtype",168,35926874,"MaxQuant score",51.2760000,1.0000000,0.6078629,,,0.028441600501537,0.4004100
AQKIPEEGWTMQDGTPWPGNNTR,ub,K,475,true,"upl3 mutant / wildtype",168,35926874,"MaxQuant score",61.4370000,1.0000000,-0.7369656,,,1.4008200196258E-5,0.1663600
KYNYEKR,ub,K,679,true,"Ubiquitination Membrane Proteins",120,33585938,,,,,,,,
GINRSDSNAPLFNMEDIDEGFEGYDDER,ph,S,688,true,"TOR Kinase and ABA Receptor",100,29290610,XCorr,5.3603692,0.9885000,,,,0.00018540000019129,
SDSNAPLFNMEDIDEGFEGYDDER,ph,S,688,true,"Conserved plant phosphoproteome - Arabidopsis",61a,20466843,"MASCOT Score",81.0000000,1.0000000,,,,,
SDSNAPLFNMEDIDEGFEGYDDER,ph,S,688,true,"srk2dei ABA signaling phopshoproteomics",83,23572148,"MASCOT Score",67.0000000,,,,,,-0.0044000
SILMSQR,ph,S,710,true,"Tissue atlas Arabidopsis - ProteomicsDB",114,32188942,"MaxQuant score",66.2700000,0.9999960,,,,0.012900999747217,
EAIHVISCGYEDK,ox,C,758,false,"SPEAR - 10 mM H2O2 / mock",138a,34619326,,,,4.7140712,0.0001371,YES,,
