Peptide,PTM,ModifiedAA,ModifiedPosition,PeptideUniqueToGene,ExperimentDesc,ExpID,PubmedID,ScoreType,IdentScore,LocProb,Log2FChange,PQ-val,QuantSig,PEP,MassErrorPPM
LTGNPSNEAQSSR,ph,S,623,true,"Tissue atlas Arabidopsis - ProteomicsDB",114,32188942,"MaxQuant score",141.5900000,0.9999480,,,,5.8596301641956E-6,
LTGNPSNEAQSSR,ph,S,628,true,"Tissue atlas Arabidopsis - ProteomicsDB",114,32188942,"MaxQuant score",261.8400000,0.8103420,,,,0,
SNRIEIPTLLDEPDR,ph,S,631,true,"Tissue atlas Arabidopsis - ProteomicsDB",114,32188942,"MaxQuant score",77.3910000,0.9999940,,,,7.9398203524761E-5,
SQSVQVVEPEVQNITDDR,ph,S,1006,true,"Tissue atlas Arabidopsis - ProteomicsDB",114,32188942,"MaxQuant score",191.6400000,0.8034320,,,,4.2038953929745E-45,
SQSVQVVEPEVQNITDDR,ph,S,1008,true,"Tissue atlas Arabidopsis - ProteomicsDB",114,32188942,"MaxQuant score",153.0600000,0.8715220,,,,5.6289400801856E-18,
RSASEAGLDEAAAPK,ph,S,1077,true,"Tissue atlas Arabidopsis - ProteomicsDB",114,32188942,"MaxQuant score",78.8480000,0.8723150,,,,0.00021103699691594,
SASEAGLDEAAAPK,ph,S,1079,true,"Tissue atlas Arabidopsis - ProteomicsDB",114,32188942,"MaxQuant score",212.9300000,0.9999930,,,,1.2891945871788E-43,
GETLNSDQFTFK,ph,T,1099,true,"Tissue atlas Arabidopsis - ProteomicsDB",114,32188942,"MaxQuant score",236.1200000,1.0000000,,,,0,
GETLNSDQFTFKYSGEK,ph,S,1110,true,"Tissue atlas Arabidopsis - ProteomicsDB",114,32188942,"MaxQuant score",127.9600000,0.9863450,,,,2.8659399853304E-10,
CADQAK,so,C,1190,true,"S-sulfenylation site detection using YAP1C",110,32714340,,,,,,,,
DMKEMASLR,ub,K,1203,true,"upl3 mutant / wildtype",168,35926874,"MaxQuant score",66.0560000,1.0000000,0.1814206,,,0.0054590902291238,0.0334030
IAASELSGLK,ph,S,1327,true,"Tissue atlas Arabidopsis - ProteomicsDB",114,32188942,"MaxQuant score",132.5600000,0.9999780,,,,2.3308999516303E-5,
RATDEVNALNVIELGDDDLNMSPDQLGFSR,ph,S,1356,true,"Arabidopsis root NAA phosphoproteome",18a,27643528,"MaxQuant Score",55.5320000,0.9990000,,,,5.2079999477428E-6,-1.1130000
RATDEVNALNVIELGDDDLNMSPDQLGFSR,ph,S,1356,true,"TOR Kinase and ABA Receptor",100,29290610,XCorr,5.1474538,1.0000000,,,,5.7600002545399E-10,
RATDEVNALNVIELGDDDLNMSPDQLGFSR,ph,S,1356,true,"Tissue atlas Arabidopsis - ProteomicsDB",114,32188942,"MaxQuant score",61.2410000,0.9959380,,,,2.1256799698222E-7,
ATDEVNALNVIELGDDDLNMSPDQLGFSR,ph,S,1356,true,"SnRK2 protein kinase substrates",85,23776212,XCorr,2.9701750,1.0000000,,,,0.00052601401694119,
QISQVAPVADQHGSNVDLLAEVIR,ph,S,1367,true,"Tissue atlas Arabidopsis - ProteomicsDB",114,32188942,"MaxQuant score",73.7710000,0.9889800,,,,7.4020598539448E-9,
QISQVAPVADQHGSNVDLLAEVIRR,ph,S,1378,true,"Tissue atlas Arabidopsis - ProteomicsDB",114,32188942,"MaxQuant score",61.2500000,0.9999980,,,,2.6797599730344E-6,
RVSVEETNQTT,ph,S,1391,true,"atm and atr DNA damage response",88,25561503,"MASCOT Score",50.0000000,1.0000000,,,,,0.1500000
RVSVEETNQTT,ph,S,1391,true,"Tissue atlas Arabidopsis - ProteomicsDB",114,32188942,"MaxQuant score",120.8400000,0.9991180,,,,1.7004900655593E-5,
