Peptide,PTM,ModifiedAA,ModifiedPosition,PeptideUniqueToGene,ExperimentDesc,ExpID,PubmedID,ScoreType,IdentScore,LocProb,Log2FChange,PQ-val,QuantSig,PEP,MassErrorPPM
SDSDKELENQIIEAGEK,ph,S,2,true,"Phospho cell culture sucrose/TOR",109,30833711,,,0.8005470,,,,,
SDSDKELENQIIEAGEK,ph,S,2,true,"Tissue atlas Arabidopsis - ProteomicsDB",114,32188942,"MaxQuant score",396.3600000,0.9999900,,,,0,
SDSDKELENQIIEAGEK,ph,S,4,true,"Phospho cell culture sucrose/TOR",109,30833711,,,0.9609840,,,,,
SDSDKELENQIIEAGEK,ph,S,4,true,"Tissue atlas Arabidopsis - ProteomicsDB",114,32188942,"MaxQuant score",422.4600000,0.9981180,,,,0,
VAVAACISEITR,so,C,82,true,"Arabidopsis S-sulfenylation chemoproteomics",108,31578252,"pFind PSM Score",0.0002139,,1.4090000,,,,-0.9922485
LAEQVLSNCASK,sno,C,221,true,"Site-specific nitrosomeproteomic id - gsnor1-3",90b,25699590,XCorr,3.2800000,,,,,0.11209999769926,-5.5400000
LAEQVLSNCASK,sno,C,221,true,"hot5-4 / wildtype, FAT-switch S-nitrosoproteome",169,37277371,,,,0.2936156,0.1744684,NO,,
YSNIVASICEGTFSALQQDQVVANEKEDSQGHIKR,ph,S,271,true,"Tissue atlas Arabidopsis - ProteomicsDB",114,32188942,"MaxQuant score",541.0900000,1.0000000,,,,0,
YSNIVASICEGTFSALQQDQVVANEKEDSQGHIK,ph,S,271,true,"Arabidopsis root NAA phosphoproteome",18a,27643528,"MaxQuant Score",99.8670000,1.0000000,,,,2.2279999568366E-13,0.6440000
EDSQGHIK,ph,S,271,true,"atm and atr DNA damage response",88,25561503,"MASCOT Score",32.0000000,1.0000000,,,,,-2.5100000
AAEISTPERTDAPKDESGK,ph,S,288,true,"Phosphoproteome ethylene-regulated time response",46,24043427,"MASCOT Score",53.8100000,,,,,,-4.7904000
AAEISTPERTDAPKDESGK,ph,S,288,true,"Phospho cell culture sucrose/TOR",109,30833711,,,0.7812770,,,,,
AAEISTPERTDAPK,ph,S,288,true,"Large-scale phosphorylation discovery",44,23111157,XCorr,3.5590000,,,,,,
AAEISTPERTDAPK,ph,S,288,true,"srk2dei ABA signaling phopshoproteomics",83,23572148,"MASCOT Score",42.0000000,,,,,,-0.0002000
AAEISTPER,ph,S,288,true,"atm and atr DNA damage response",88,25561503,"MASCOT Score",28.0000000,1.0000000,,,,,0.0300000
AAEISTPER,ph,S,288,true,"Tissue atlas Arabidopsis - ProteomicsDB",114,32188942,"MaxQuant score",111.5300000,1.0000000,,,,1.194799953419E-10,
AAEISTPERTDAPKDESGK,ph,T,289,true,"Phosphoproteome ethylene-regulated time response",46,24043427,"MASCOT Score",46.9100000,,,,,,12.3723000
AAEISTPERTDAPKDESGK,ph,T,289,true,"srk2dei ABA signaling phopshoproteomics",83,23572148,"MASCOT Score",48.0000000,,,,,,0.0010000
AAEISTPERTDAPKDESGK,ph,T,289,true,"SnRK2 protein kinase substrates",85,23776212,XCorr,3.8194113,0.8590000,,,,0.00061142700724304,
AAEISTPERTDAPK,ph,T,289,true,"Arabidopsis root NAA phosphoproteome",18a,27643528,"MaxQuant Score",97.2350000,0.8270000,,,,3.3329999871157E-10,-0.4080000
AAEISTPERTDAPK,ph,T,289,true,"Large-scale phosphorylation discovery",44,23111157,XCorr,3.0140000,,,,,,
AAEISTPERTDAPK,ph,T,289,true,"Phosphoproteome ethylene-regulated time response",46,24043427,"MASCOT Score",40.2300000,,,,,,-2.9787000
AAEISTPERTDAPK,ph,T,289,true,"Chloroplast kinase substrates",60,19376835,"MASCOT Score",43.4000000,,,,,,-1.0393500
AAEISTPERTDAPK,ph,T,289,true,"srk2dei ABA signaling phopshoproteomics",83,23572148,"MASCOT Score",46.0000000,,,,,,-0.0010000
AAEISTPERTDAPK,ph,T,289,true,"SnRK2 protein kinase substrates",85,23776212,XCorr,3.0020256,0.9540000,,,,0.00080395402619615,
AAEISTPERTDAPK,ph,T,289,true,"Phospho cell culture sucrose/TOR",109,30833711,,,0.9942260,,,,,
AAEISTPERTDAPK,ph,T,289,true,"Col-0 callus - FC Col-0 vs. Col-0 Xray",111a,31410901,,36.2200000,,-2.4839823,0.0000000,NO,,0.6288992
AAEISTPERTDAPK,ph,T,289,true,"Col-0 X-ray callus - FC Col-0 vs. Col-0 Xray",111b,31410901,,36.2200000,,-2.4839823,0.0000000,NO,,0.6288992
AAEISTPERTDAPK,ph,T,289,true,"atm callus - FC atm vs. atm Xray",111c,31410901,,36.2200000,,-0.6420395,0.0000000,NO,,0.6288992
AAEISTPERTDAPK,ph,T,289,true,"atm-3 X-ray callus - FC atm vs. atm Xray",111d,31410901,,36.2200000,,-0.6420395,0.0000000,NO,,0.6288992
AAEISTPER,ph,T,289,true,"STN8 phosphoproteome",38,21768351,"MASCOT Score",50.8800000,,,,,,0.4254440
AAEISTPER,ph,T,289,true,"Large-scale phosphorylation discovery",44,23111157,XCorr,3.0710000,,,,,,
AAEISTPER,ph,T,289,true,"Chloroplast kinase substrates",60,19376835,"MASCOT Score",44.5400000,,,,,,-0.7694700
AAEISTPER,ph,T,289,true,"SnRK2 protein kinase substrates",85,23776212,XCorr,2.5471039,0.9990000,,,,0.063059501349926,
AAEISTPER,ph,T,289,true,"atm and atr DNA damage response",88,25561503,"MASCOT Score",41.0000000,1.0000000,,,,,0.5600000
AAEISTPER,ph,T,289,true,"TOR Kinase and ABA Receptor",100,29290610,XCorr,2.7822380,0.9413000,,,,0.024779999628663,
AAEISTPER,ph,T,289,true,"Lateral root-induction - NAA vs control",106,23328941,"MASCOT Score",23.0000000,,,,,,
AAEISTPER,ph,T,289,true,"Tissue atlas Arabidopsis - ProteomicsDB",114,32188942,"MaxQuant score",264.3100000,1.0000000,,,,0,
AAEISTPERTDAPKDESGK,ph,T,293,true,"srk2dei ABA signaling phopshoproteomics",83,23572148,"MASCOT Score",23.0000000,,,,,,-0.0008000
AAEISTPERTDAPK,ph,T,293,true,"srk2dei ABA signaling phopshoproteomics",83,23572148,"MASCOT Score",37.0000000,,,,,,0.0003000
SGVSNGVAQQNDSSVDTDSMK,ph,S,306,true,"atm and atr DNA damage response",88,25561503,"MASCOT Score",54.0000000,1.0000000,,,,,-0.6900000
SGVSNGVAQQNDSSVDTDSMK,ph,S,306,true,"Tissue atlas Arabidopsis - ProteomicsDB",114,32188942,"MaxQuant score",214.3000000,0.9689850,,,,0,
SGVSNGVAQQNDSSVDTDSMK,ph,S,315,true,"Tissue atlas Arabidopsis - ProteomicsDB",114,32188942,"MaxQuant score",256.6600000,0.9250320,,,,0,
SGVSNGVAQQNDSSVDTDSMK,ph,S,316,true,"Tissue atlas Arabidopsis - ProteomicsDB",114,32188942,"MaxQuant score",226.5600000,0.9549750,,,,0,
SGVSNGVAQQNDSSVDTDSMK,ph,T,319,true,"Tissue atlas Arabidopsis - ProteomicsDB",114,32188942,"MaxQuant score",65.7650000,0.7566880,,,,2.5568200726411E-5,
KQDDTGAKDEPQQLDNPR,ph,T,328,true,"Tissue atlas Arabidopsis - ProteomicsDB",114,32188942,"MaxQuant score",160.8800000,1.0000000,,,,7.2358199635993E-22,
NTDLNNTTEEKPDVEHQIEEK,ph,T,348,true,"Tissue atlas Arabidopsis - ProteomicsDB",114,32188942,"MaxQuant score",152.8800000,0.8793770,,,,2.9694601098657E-26,
NTDLNNTTEEKPDVEHQIEEK,ph,T,349,true,"Tissue atlas Arabidopsis - ProteomicsDB",114,32188942,"MaxQuant score",183.5800000,0.9319040,,,,1.1210387714599E-44,
ENESSSVKQADLSK,ph,S,368,true,"Tissue atlas Arabidopsis - ProteomicsDB",114,32188942,"MaxQuant score",81.5100000,0.7904600,,,,2.0293600755394E-5,
QADLSKDSDIKEETEPAELLDSK,ph,S,375,true,"SnRK2 protein kinase substrates",85,23776212,XCorr,2.2699547,0.7920000,,,,0.018319800496101,
QADLSKDSDIKEETEPAELLDSK,ph,S,375,true,"Tissue atlas Arabidopsis - ProteomicsDB",114,32188942,"MaxQuant score",186.4500000,0.9978500,,,,0,
QADLSKDSDIKEETEPAELLDSK,ph,S,378,true,"srk2dei ABA signaling phopshoproteomics",83,23572148,"MASCOT Score",25.0000000,,,,,,0.0000000
QADLSKDSDIKEETEPAELLDSK,ph,S,378,true,"TOR Kinase and ABA Receptor",100,29290610,XCorr,4.1239085,0.8317000,,,,0.0016550000291318,
QADLSKDSDIKEETEPAELLDSK,ph,S,378,true,"Phospho cell culture sucrose/TOR",109,30833711,,,0.9813200,,,,,
DSDIKEETEPAELLDSK,ph,S,378,true,"Tissue atlas Arabidopsis - ProteomicsDB",114,32188942,"MaxQuant score",287.1200000,1.0000000,,,,0,
DSDIKEETEPAELLDSK,ph,T,384,true,"Tissue atlas Arabidopsis - ProteomicsDB",114,32188942,"MaxQuant score",362.9600000,1.0000000,,,,0,
DVLTSPPVDSSVTAATSSENEK,ph,S,398,true,"Tissue atlas Arabidopsis - ProteomicsDB",114,32188942,"MaxQuant score",218.1400000,0.9984240,,,,0,
DVLTSPPVDSSVTAATSSENEK,ph,S,403,true,"Tissue atlas Arabidopsis - ProteomicsDB",114,32188942,"MaxQuant score",146.7200000,0.8712250,,,,5.265040115688E-34,
DVLTSPPVDSSVTAATSSENEKNK,ph,S,410,true,"Tissue atlas Arabidopsis - ProteomicsDB",114,32188942,"MaxQuant score",351.4100000,0.8630560,,,,0,
DVLTSPPVDSSVTAATSSENEK,ph,S,410,true,"LAXIC - ABA stress",84a,23660473,XCorr,4.9700000,0.9160000,,,,1.4400000081238E-9,
DVLTSPPVDSSVTAATSSENEK,ph,S,410,true,"TOR Kinase and ABA Receptor",100,29290610,XCorr,4.5231009,0.8250000,,,,2.2810000643858E-7,
DVLTSPPVDSSVTAATSSENEKNK,ph,S,411,true,"Tissue atlas Arabidopsis - ProteomicsDB",114,32188942,"MaxQuant score",354.1400000,0.9750970,,,,0,
DVLTSPPVDSSVTAATSSENEK,ph,S,411,true,"Lateral root-induction - NAA vs control",106,23328941,"MASCOT Score",42.0000000,,,,,,
TSGDETANVSSPSMAEELPEQSVPKK,ph,S,435,true,"Tissue atlas Arabidopsis - ProteomicsDB",114,32188942,"MaxQuant score",229.9500000,0.8174090,,,,0,
TSGDETANVSSPSMAEELPEQSVPK,ph,S,435,true,"Conserved plant phosphoproteome - Arabidopsis",61a,20466843,"MASCOT Score",68.0000000,1.0000000,,,,,
TSGDETANVSSPSMAEELPEQSVPK,ph,S,435,true,"srk2dei ABA signaling phopshoproteomics",83,23572148,"MASCOT Score",80.0000000,,,,,,-0.0025000
TSGDETANVSSPSMAEELPEQSVPK,ph,S,435,true,"atm and atr DNA damage response",88,25561503,"MASCOT Score",34.0000000,1.0000000,,,,,0.5900000
TSGDETANVSSPSMAEELPEQSVPK,ph,S,435,true,"Lateral root-induction - NAA vs control",106,23328941,"MASCOT Score",36.0000000,,,,,,
TSGDETANVSSPSMAEELPEQSVPKK,ph,S,436,true,"Col-0 callus - FC Col-0 vs. Col-0 Xray",111a,31410901,,67.3800000,,-0.1705889,0.0000000,NO,,0.7335749
TSGDETANVSSPSMAEELPEQSVPKK,ph,S,436,true,"Col-0 X-ray callus - FC Col-0 vs. Col-0 Xray",111b,31410901,,67.3800000,,-0.1705889,0.0000000,NO,,0.7335749
TSGDETANVSSPSMAEELPEQSVPKK,ph,S,436,true,"atm callus - FC atm vs. atm Xray",111c,31410901,,67.3800000,,0.9742284,0.0000000,NO,,0.7335749
TSGDETANVSSPSMAEELPEQSVPKK,ph,S,436,true,"atm-3 X-ray callus - FC atm vs. atm Xray",111d,31410901,,67.3800000,,0.9742284,0.0000000,NO,,0.7335749
TSGDETANVSSPSMAEELPEQSVPKK,ph,S,436,true,"Tissue atlas Arabidopsis - ProteomicsDB",114,32188942,"MaxQuant score",261.7900000,0.9946710,,,,0,
TSGDETANVSSPSMAEELPEQSVPK,ph,S,436,true,"Large-scale phosphorylation discovery",44,23111157,XCorr,3.3130000,,,,,,
TSGDETANVSSPSMAEELPEQSVPK,ph,S,436,true,"Conserved plant phosphoproteome - Arabidopsis",61a,20466843,"MASCOT Score",68.0000000,1.0000000,,,,,
TSGDETANVSSPSMAEELPEQSVPK,ph,S,436,true,"srk2dei ABA signaling phopshoproteomics",83,23572148,"MASCOT Score",87.0000000,,,,,,-0.0043000
TSGDETANVSSPSMAEELPEQSVPK,ph,S,436,true,"LAXIC - ABA stress",84a,23660473,XCorr,5.7800000,0.8430000,,,,6.7899998157372E-7,
TSGDETANVSSPSMAEELPEQSVPK,ph,S,436,true,"LAXIC - mannitol vs control",84b,23660473,XCorr,4.7200000,0.9830000,,,,3.1700000263646E-11,
TSGDETANVSSPSMAEELPEQSVPK,ph,S,436,true,"SnRK2 protein kinase substrates",85,23776212,XCorr,4.4743090,0.9950000,,,,0.0012170600239187,
TSGDETANVSSPSMAEELPEQSVPK,ph,S,436,true,"atm and atr DNA damage response",88,25561503,"MASCOT Score",46.0000000,0.9760000,,,,,0.1300000
TSGDETANVSSPSMAEELPEQSVPK,ph,S,436,true,"TOR Kinase and ABA Receptor",100,29290610,XCorr,4.7903571,0.9855000,,,,2.3519999103883E-6,
TSGDETANVSSPSMAEELPEQSVPK,ph,S,436,true,"Lateral root-induction - NAA vs control",106,23328941,"MASCOT Score",42.0000000,,,,,,
TSGDETANVSSPSMAEELPEQSVPKK,ph,S,438,true,"SnRK2 protein kinase substrates",85,23776212,XCorr,5.9282727,0.8790000,,,,3.96250006599E-16,
TSGDETANVSSPSMAEELPEQSVPKK,ph,S,438,true,"Tissue atlas Arabidopsis - ProteomicsDB",114,32188942,"MaxQuant score",94.0440000,0.8359390,,,,1.1168199882689E-13,
TSGDETANVSSPSMAEELPEQSVPK,ph,S,438,true,"srk2dei ABA signaling phopshoproteomics",83,23572148,"MASCOT Score",46.0000000,,,,,,0.0007000
TSGDETANVSSPSMAEELPEQSVPK,ph,S,438,true,"LAXIC - ABA stress",84a,23660473,XCorr,4.5600000,0.8180000,,,,0.00030930098728277,
TSGDETANVSSPSMAEELPEQSVPK,ph,S,438,true,"atm and atr DNA damage response",88,25561503,"MASCOT Score",26.0000000,0.9850000,,,,,-2.5800000
TSGDETANVSSPSMAEELPEQSVPK,ph,S,438,true,"Brassinosteroid-Regulated Phosphorylation Dynamics",94,26187819,"MaxQuant Score",67.7600000,0.7780000,,,,0.010999999940395,0.7390000
TSGDETANVSSPSMAEELPEQSVPK,ph,S,438,true,"TOR Kinase and ABA Receptor",100,29290610,XCorr,4.6091056,0.9997000,,,,5.5550000979565E-5,
TSGDETANVSSPSMAEELPEQSVPKK,ph,S,447,true,"Tissue atlas Arabidopsis - ProteomicsDB",114,32188942,"MaxQuant score",85.8580000,0.9947110,,,,1.0598600337682E-15,
ESSTEEVKPSASIATEEVSEEPNTSEPQVTK,ph,S,468,true,"Tissue atlas Arabidopsis - ProteomicsDB",114,32188942,"MaxQuant score",202.6900000,0.7533080,,,,0,
PSASIATEEVSEEPNTSEPQVTK,ph,S,468,true,"Phospho cell culture sucrose/TOR",109,30833711,,,0.7715080,,,,,
ESSTEEVKPSASIATEEVSEEPNTSEPQVTK,ph,S,470,true,"Large-scale phosphorylation discovery",44,23111157,XCorr,4.8940000,,,,,,
ESSTEEVKPSASIATEEVSEEPNTSEPQVTK,ph,S,470,true,"TOR Kinase and ABA Receptor",100,29290610,XCorr,4.9902158,0.8395000,,,,0.00011249999806751,
ESSTEEVKPSASIATEEVSEEPNTSEPQVTK,ph,S,470,true,"Tissue atlas Arabidopsis - ProteomicsDB",114,32188942,"MaxQuant score",202.6900000,0.8296750,,,,0,
ESSTEEVKPSASIATEEVSEEPNTSEPQVTK,ph,T,473,true,"Tissue atlas Arabidopsis - ProteomicsDB",114,32188942,"MaxQuant score",156.7300000,0.7932920,,,,0,
KESSTEEVKPSASIATEEVSEEPNTSEPQVTK,ph,S,477,true,"Phospho cell culture sucrose/TOR",109,30833711,,,0.9999400,,,,,
ESSTEEVKPSASIATEEVSEEPNTSEPQVTK,ph,S,477,true,"Large-scale phosphorylation discovery",44,23111157,XCorr,5.1040000,,,,,,
ESSTEEVKPSASIATEEVSEEPNTSEPQVTK,ph,S,477,true,"srk2dei ABA signaling phopshoproteomics",83,23572148,"MASCOT Score",50.0000000,,,,,,-0.0047000
ESSTEEVKPSASIATEEVSEEPNTSEPQVTK,ph,S,477,true,"LAXIC - ABA stress",84a,23660473,XCorr,5.7600000,0.8980000,,,,0.00020625599427149,
ESSTEEVKPSASIATEEVSEEPNTSEPQVTK,ph,S,477,true,"SnRK2 protein kinase substrates",85,23776212,XCorr,4.9305191,0.9970000,,,,2.3010200411733E-9,
ESSTEEVKPSASIATEEVSEEPNTSEPQVTK,ph,S,477,true,"TOR Kinase and ABA Receptor",100,29290610,XCorr,7.2590823,1.0000000,,,,9.6720000897221E-9,
ESSTEEVKPSASIATEEVSEEPNTSEPQVTK,ph,S,477,true,"Tissue atlas Arabidopsis - ProteomicsDB",114,32188942,"MaxQuant score",312.8400000,1.0000000,,,,0,
ESSTEEVKPSASIATEEVSEEPNTSEPQVTK,ph,S,477,true,"Touch-induced phosphorylation: 40s touch vs untouc",136,30291188,"MASCOT score",88.6800000,,-0.0435935,0.8699795,NO,,-4.0779682
ESSTEEVKPSASIATEEVSEEPNTSEPQVTKK,ph,T,482,true,"Tissue atlas Arabidopsis - ProteomicsDB",114,32188942,"MaxQuant score",164.7600000,0.8952420,,,,0,
KESSTEEVKPSASIATEEVSEEPNTSEPQVTK,ph,S,483,true,"Phospho cell culture sucrose/TOR",109,30833711,,,0.7944900,,,,,
ESSTEEVKPSASIATEEVSEEPNTSEPQVTK,ph,S,483,true,"Tissue atlas Arabidopsis - ProteomicsDB",114,32188942,"MaxQuant score",209.5600000,0.9449010,,,,0,
KVASSSKTKPTVPPSK,ub,K,502,true,"Protein ubiquitination during photomorphogenesis",3,28461270,,,,,,,,
KVVGSDNAQESTKPK,ph,S,528,true,"Tissue atlas Arabidopsis - ProteomicsDB",114,32188942,"MaxQuant score",87.6470000,0.9999990,,,,7.469899719581E-5,
KVVGSDNAQESTKPK,ph,S,534,true,"Tissue atlas Arabidopsis - ProteomicsDB",114,32188942,"MaxQuant score",197.8400000,0.8199300,,,,5.149230044903E-35,
VVGSDNAQESTKPK,ph,S,534,true,"TOR Kinase and ABA Receptor",100,29290610,XCorr,3.6685390,0.9159000,,,,0.0061360001564026,
AIDEESLHTSSGDNEKPAVSSGK,ph,S,554,true,"srk2dei ABA signaling phopshoproteomics",83,23572148,"MASCOT Score",23.0000000,,,,,,0.0013000
AIDEESLHTSSGDNEKPAVSSGK,ph,S,554,true,"Brassinosteroid-Regulated Phosphorylation Dynamics",94,26187819,"MaxQuant Score",113.1300000,0.8280000,,,,9.1560002601909E-7,1.9530000
AIDEESLHTSSGDNEKPAVSSGK,ph,S,554,true,"Phospho cell culture sucrose/TOR",109,30833711,,,0.9995820,,,,,
AIDEESLHTSSGDNEKPAVSSGK,ph,S,554,true,"Tissue atlas Arabidopsis - ProteomicsDB",114,32188942,"MaxQuant score",251.0700000,1.0000000,,,,0,
AIDEESLHTSSGDNEKPAVSSGK,ph,T,557,true,"Phosphoproteome ethylene-regulated time response",46,24043427,"MASCOT Score",110.1400000,,,,,,-3.0663000
AIDEESLHTSSGDNEKPAVSSGK,ph,T,557,true,"srk2dei ABA signaling phopshoproteomics",83,23572148,"MASCOT Score",41.0000000,,,,,,-0.0006000
AIDEESLHTSSGDNEKPAVSSGK,ph,T,557,true,"LAXIC - mannitol vs control",84b,23660473,XCorr,3.9300000,0.9060000,2.7204332,,NO,3.6400000681169E-5,
AIDEESLHTSSGDNEKPAVSSGK,ph,T,557,true,"SnRK2 protein kinase substrates",85,23776212,XCorr,3.5416727,0.9390000,,,,0.00015525199705735,
AIDEESLHTSSGDNEKPAVSSGK,ph,T,557,true,"atm and atr DNA damage response",88,25561503,"MASCOT Score",29.0000000,0.9930000,,,,,0.8000000
AIDEESLHTSSGDNEKPAVSSGK,ph,T,557,true,"Brassinosteroid-Regulated Phosphorylation Dynamics",94,26187819,"MaxQuant Score",113.1300000,0.9700000,,,,9.1560002601909E-7,2.5620000
AIDEESLHTSSGDNEKPAVSSGK,ph,T,557,true,"Tissue atlas Arabidopsis - ProteomicsDB",114,32188942,"MaxQuant score",169.9600000,0.9999480,,,,1.5414283107573E-44,
AIDEESLHTSSGDNEKPAVSSGK,ph,S,558,true,"srk2dei ABA signaling phopshoproteomics",83,23572148,"MASCOT Score",49.0000000,,,,,,-0.0002000
AIDEESLHTSSGDNEKPAVSSGK,ph,S,558,true,"LAXIC - ABA stress",84a,23660473,XCorr,4.4100000,0.9070000,,,,2.3399999918183E-5,
AIDEESLHTSSGDNEKPAVSSGK,ph,S,558,true,"LAXIC - mannitol vs control",84b,23660473,XCorr,4.3300000,0.9040000,2.2410303,,NO,1.0399999750277E-9,
AIDEESLHTSSGDNEKPAVSSGK,ph,S,558,true,"SnRK2 protein kinase substrates",85,23776212,XCorr,4.6943889,0.9670000,,,,0.00084814400179312,
AIDEESLHTSSGDNEKPAVSSGK,ph,S,558,true,"atm and atr DNA damage response",88,25561503,"MASCOT Score",36.0000000,0.8600000,,,,,-1.7300000
AIDEESLHTSSGDNEKPAVSSGK,ph,S,558,true,"Brassinosteroid-Regulated Phosphorylation Dynamics",94,26187819,"MaxQuant Score",113.1300000,0.9940000,,,,9.1560002601909E-7,2.5620000
AIDEESLHTSSGDNEKPAVSSGK,ph,S,558,true,"TOR Kinase and ABA Receptor",100,29290610,XCorr,4.4250779,0.9850000,,,,0.049159999936819,
AIDEESLHTSSGDNEKPAVSSGK,ph,S,558,true,"Phospho cell culture sucrose/TOR",109,30833711,,,0.9999990,,,,,
AIDEESLHTSSGDNEKPAVSSGK,ph,S,558,true,"Col-0 callus - FC Col-0 vs. Col-0 Xray",111a,31410901,,57.8500000,,-1.1553385,0.0000000,NO,,2.4041862
AIDEESLHTSSGDNEKPAVSSGK,ph,S,558,true,"Col-0 X-ray callus - FC Col-0 vs. Col-0 Xray",111b,31410901,,57.8500000,,-1.1553385,0.0000000,NO,,2.4041862
AIDEESLHTSSGDNEKPAVSSGK,ph,S,558,true,"atm callus - FC atm vs. atm Xray",111c,31410901,,57.8500000,,-0.1952646,0.0000000,NO,,2.4041862
AIDEESLHTSSGDNEKPAVSSGK,ph,S,558,true,"atm-3 X-ray callus - FC atm vs. atm Xray",111d,31410901,,57.8500000,,-0.1952646,0.0000000,NO,,2.4041862
AIDEESLHTSSGDNEKPAVSSGK,ph,S,558,true,"Tissue atlas Arabidopsis - ProteomicsDB",114,32188942,"MaxQuant score",332.6800000,0.9999990,,,,0,
AIDEESLHTSSGDNEKPAVSSGK,ph,S,559,true,"Large-scale phosphorylation discovery",44,23111157,XCorr,4.7650000,,,,,,
AIDEESLHTSSGDNEKPAVSSGK,ph,S,559,true,"Phosphoproteome ethylene-regulated time response",46,24043427,"MASCOT Score",43.2700000,,,,,,0.2532600
AIDEESLHTSSGDNEKPAVSSGK,ph,S,559,true,"srk2dei ABA signaling phopshoproteomics",83,23572148,"MASCOT Score",56.0000000,,,,,,0.0014000
AIDEESLHTSSGDNEKPAVSSGK,ph,S,559,true,"LAXIC - ABA stress",84a,23660473,XCorr,4.4100000,0.9070000,,,,2.3399999918183E-5,
AIDEESLHTSSGDNEKPAVSSGK,ph,S,559,true,"LAXIC - mannitol vs control",84b,23660473,XCorr,4.3300000,0.9040000,2.2410303,,NO,1.0399999750277E-9,
AIDEESLHTSSGDNEKPAVSSGK,ph,S,559,true,"SnRK2 protein kinase substrates",85,23776212,XCorr,4.5920892,0.9950000,,,,0.00015597100718878,
AIDEESLHTSSGDNEKPAVSSGK,ph,S,559,true,"atm and atr DNA damage response",88,25561503,"MASCOT Score",30.0000000,0.9880000,,,,,0.1200000
AIDEESLHTSSGDNEKPAVSSGK,ph,S,559,true,"Brassinosteroid-Regulated Phosphorylation Dynamics",94,26187819,"MaxQuant Score",113.1300000,0.9940000,,,,9.1560002601909E-7,2.5620000
AIDEESLHTSSGDNEKPAVSSGK,ph,S,559,true,"TOR Kinase and ABA Receptor",100,29290610,XCorr,4.4250779,0.9850000,,,,0.049159999936819,
AIDEESLHTSSGDNEKPAVSSGK,ph,S,559,true,"Col-0 callus - FC Col-0 vs. Col-0 Xray",111a,31410901,,44.2600000,,-1.1510639,0.0000000,NO,,0.9408938
AIDEESLHTSSGDNEKPAVSSGK,ph,S,559,true,"Col-0 X-ray callus - FC Col-0 vs. Col-0 Xray",111b,31410901,,44.2600000,,-1.1510639,0.0000000,NO,,0.9408938
AIDEESLHTSSGDNEKPAVSSGK,ph,S,559,true,"atm callus - FC atm vs. atm Xray",111c,31410901,,44.2600000,,-0.7318757,0.0000000,NO,,0.9408938
AIDEESLHTSSGDNEKPAVSSGK,ph,S,559,true,"atm-3 X-ray callus - FC atm vs. atm Xray",111d,31410901,,44.2600000,,-0.7318757,0.0000000,NO,,0.9408938
AIDEESLHTSSGDNEKPAVSSGK,ph,S,559,true,"Tissue atlas Arabidopsis - ProteomicsDB",114,32188942,"MaxQuant score",343.6800000,1.0000000,,,,0,
AIDEESLHTSSGDNEKPAVSSGK,ph,S,568,true,"Large-scale phosphorylation discovery",44,23111157,XCorr,2.7880000,,,,,,
AIDEESLHTSSGDNEKPAVSSGK,ph,S,568,true,"Tissue atlas Arabidopsis - ProteomicsDB",114,32188942,"MaxQuant score",204.6600000,0.8418180,,,,0,
QTVEESPNSNTKR,ph,S,587,true,"atm and atr DNA damage response",88,25561503,"MASCOT Score",49.0000000,1.0000000,,,,,-0.6000000
QTVEESPNSNTKR,ph,S,587,true,"Tissue atlas Arabidopsis - ProteomicsDB",114,32188942,"MaxQuant score",266.6000000,1.0000000,,,,0,
QTVEESPNSNTK,ph,S,587,true,"SnRK2 protein kinase substrates",85,23776212,XCorr,3.3558884,0.9970000,,,,9.4209697820702E-9,
QTVEESPNSNTK,ph,S,587,true,"atm and atr DNA damage response",88,25561503,"MASCOT Score",65.0000000,1.0000000,,,,,-1.8000000
QTVEESPNSNTK,ph,S,587,true,"TOR Kinase and ABA Receptor",100,29290610,XCorr,4.2358789,0.9994000,,,,1.8419999605612E-6,
QTVEESPNSNTK,ph,S,587,true,"Phospho cell culture sucrose/TOR",109,30833711,,,0.9975530,,,,,
QTVEESPNSNTK,ph,S,590,true,"atm and atr DNA damage response",88,25561503,"MASCOT Score",48.0000000,0.9430000,,,,,-0.5700000
QTVEESPNSNTK,ph,S,590,true,"Tissue atlas Arabidopsis - ProteomicsDB",114,32188942,"MaxQuant score",193.9600000,0.9871790,,,,1.7371200310271E-24,
QTVEESPNSNTKR,ac,K,593,true,"Quantitative Acetylproteomics",101,29440448,,,,,,,,
SLGQGKASGESLVGSR,ub,K,602,true,"Arabidopsis ubiquitination COFRADIC",40,26744219,"MaxQuant Score",136.3600000,1.0000000,,,,1.2119999918063E-28,-0.2110000
ASGESLVGSR,ph,S,604,true,"Tissue atlas Arabidopsis - ProteomicsDB",114,32188942,"MaxQuant score",53.3670000,0.9975210,,,,0.0074897902086377,
ASGESLVGSR,ph,S,607,true,"atm and atr DNA damage response",88,25561503,"MASCOT Score",45.0000000,0.9890000,,,,,-2.1200000
ASGESLVGSR,ph,S,607,true,"Tissue atlas Arabidopsis - ProteomicsDB",114,32188942,"MaxQuant score",92.7920000,0.9997960,,,,0.00089985702652484,
WSPLDESELSQDEEAADQTGQEEDASTVPLTK,ph,S,663,true,"srk2dei ABA signaling phopshoproteomics",83,23572148,"MASCOT Score",51.0000000,,,,,,-0.0002000
WSPLDESELSQDEEAADQTGQEEDASTVPLTKK,ph,S,666,true,"SnRK2 protein kinase substrates",85,23776212,XCorr,4.8004637,0.9810000,,,,0.001376620028168,
WSPLDESELSQDEEAADQTGQEEDASTVPLTKK,ph,S,666,true,"Col-0 callus - FC Col-0 vs. Col-0 Xray",111a,31410901,,52.1200000,,0.7586878,0.0000000,NO,,1.0421816
WSPLDESELSQDEEAADQTGQEEDASTVPLTKK,ph,S,666,true,"Col-0 X-ray callus - FC Col-0 vs. Col-0 Xray",111b,31410901,,52.1200000,,0.7586878,0.0000000,NO,,1.0421816
WSPLDESELSQDEEAADQTGQEEDASTVPLTKK,ph,S,666,true,"atm callus - FC atm vs. atm Xray",111c,31410901,,52.1200000,,2.1988809,0.0000000,NO,,1.0421816
WSPLDESELSQDEEAADQTGQEEDASTVPLTKK,ph,S,666,true,"atm-3 X-ray callus - FC atm vs. atm Xray",111d,31410901,,52.1200000,,2.1988809,0.0000000,NO,,1.0421816
WSPLDESELSQDEEAADQTGQEEDASTVPLTKK,ph,S,666,true,"Tissue atlas Arabidopsis - ProteomicsDB",114,32188942,"MaxQuant score",277.9800000,1.0000000,,,,0,
WSPLDESELSQDEEAADQTGQEEDASTVPLTK,ph,S,666,true,"Arabidopsis root NAA phosphoproteome",18a,27643528,"MaxQuant Score",78.6420000,0.9630000,,,,4.871000047757E-9,0.2370000
WSPLDESELSQDEEAADQTGQEEDASTVPLTK,ph,S,666,true,"STN8 phosphoproteome",38,21768351,"MASCOT Score",64.1100000,,,,,,-1.9361200
WSPLDESELSQDEEAADQTGQEEDASTVPLTK,ph,S,666,true,"srk2dei ABA signaling phopshoproteomics",83,23572148,"MASCOT Score",51.0000000,,,,,,-0.0002000
WSPLDESELSQDEEAADQTGQEEDASTVPLTK,ph,S,666,true,"LAXIC - ABA stress",84a,23660473,XCorr,4.7600000,0.8140000,,,,4.0800001443131E-5,
WSPLDESELSQDEEAADQTGQEEDASTVPLTK,ph,S,666,true,"LAXIC - mannitol vs control",84b,23660473,XCorr,5.4900000,0.9780000,,,,6.390000036944E-15,
WSPLDESELSQDEEAADQTGQEEDASTVPLTK,ph,S,666,true,"SnRK2 protein kinase substrates",85,23776212,XCorr,4.9942217,0.9730000,,,,1.1001100119756E-6,
WSPLDESELSQDEEAADQTGQEEDASTVPLTK,ph,S,666,true,"Brassinosteroid-Regulated Phosphorylation Dynamics",94,26187819,"MaxQuant Score",122.8000000,0.9890000,,,,7.7960003665211E-21,-0.9640000